Eicosane, 3-cyclohexyl-
- Formula: C26H52
- Molecular weight: 364.6911
- IUPAC Standard InChIKey: PANSPXWYXYRKGU-UHFFFAOYSA-N
- CAS Registry Number: 4443-57-6
- Chemical structure:
View 3d structure (requires JavaScript / HTML 5) - Other names: 3-Cyclohexyleicosane

Condensed phase thermochemistry data

Data compiled by: Hussein Y. Afeefy, Joel F. Liebman, and Stephen E. Stein
Quantity | Value | Units | Method | Reference | Comment |
---|---|---|---|---|---|
ΔfH°liquid | -666.2 ± 6.7 | kJ/mol | Ccb | Knowlton and Huffman, 1944 | Reanalyzed by Cox and Pilcher, 1970, Original value = -667.8 kJ/mol |
Quantity | Value | Units | Method | Reference | Comment |
ΔcH°liquid | -16996.7 ± 6.7 | kJ/mol | Ccb | Knowlton and Huffman, 1944 | Reanalyzed by Cox and Pilcher, 1970, Original value = -16995. kJ/mol; Corresponding ΔfHºliquid = -666.18 kJ/mol (simple calculation by NIST; no Washburn corrections) |

Phase change data

Data compiled as indicated in comments:
TRC - Thermodynamics Research Center, NIST Boulder Laboratories, Chris Muzny director
AC - William E. Acree, Jr., James S. Chickos
Quantity | Value | Units | Method | Reference | Comment |
---|---|---|---|---|---|
Tfus | 295.85 | K | N/A | Anonymous, 1968 | Uncertainty assigned by TRC = 0.5 K; TRC |
Tfus | 295.9 | K | N/A | Schiessler, 1947 | Uncertainty assigned by TRC = 0.5 K; TRC |
Enthalpy of vaporization
ΔvapH (kJ/mol) | Temperature (K) | Method | Reference | Comment |
---|---|---|---|---|
94. | 507. | A,MG | Stephenson and Malanowski, 1987 | Based on data from 492. to 530. K. See also Schiessler and Whitmore, 1955.; AC |

References

Knowlton and Huffman, 1944
Knowlton, J.W.; Huffman, H.M.,
The heats of combustion of some substituted eicosanes, heneicosanes and docosanes,
J. Am. Chem. Soc., 1944, 66, 1492-1494. [all data]
Cox and Pilcher, 1970
Cox, J.D.; Pilcher, G.,
Thermochemistry of Organic and Organometallic Compounds, Academic Press, New York, 1970, 1-636. [all data]
Anonymous, 1968
Anonymous, R.,
Properties of hydrocarbon of high molecular weight, Am. Pet. Inst. Res. Proj. 42, Penn. State Univ., 1968. [all data]
Schiessler, 1947
Schiessler, R.W.,
, Am. Pet. Inst. Res. Proj. 42, Twelfth Meeting, 1947. [all data]
Stephenson and Malanowski, 1987
Stephenson, Richard M.; Malanowski, Stanislaw,
Handbook of the Thermodynamics of Organic Compounds, 1987, https://doi.org/10.1007/978-94-009-3173-2
. [all data]
Schiessler and Whitmore, 1955
Schiessler, R.W.; Whitmore, F.C.,
Properties of High Molecular Weight Hydrocarbons,
Ind. Eng. Chem., 1955, 47, 8, 1660-1665, https://doi.org/10.1021/ie50548a054
. [all data]