Bornyl bromide
- Formula: C10H17Br
- Molecular weight: 217.146
- IUPAC Standard InChIKey: OTOQMOVZIUGCQE-UHFFFAOYSA-N
- CAS Registry Number: 4443-48-5
- Chemical structure:
View 3d structure (requires JavaScript / HTML 5) - Other names: Bornyl bromide, pract.; Bornane, 2-bromo-

Phase change data

Data compiled by: Robert L. Brown and Stephen E. Stein
Reduced pressure boiling point
Tboil (K) | Pressure (bar) | Reference |
---|---|---|
367. to 369. | 0.020 | Frinton Laboratories Inc., 1986 |

References

Frinton Laboratories Inc., 1986
Frinton Laboratories Inc.,
Catalog Number 11, Frinton Laboratories Inc., Vineland, NJ, 1986, 99. [all data]