3-Hexenal
- Formula: C6H10O
- Molecular weight: 98.1430
- IUPAC Standard InChIKey: GXANMBISFKBPEX-ONEGZZNKSA-N
- CAS Registry Number: 4440-65-7
- Chemical structure:
View 3d structure (requires JavaScript / HTML 5) - Species with the same structure:
- Stereoisomers:
- Other names: Hex-3-enal

Van Den Dool and Kratz RI, non-polar column, temperature ramp

Column type | Active phase | I | Reference | Comment |
---|---|---|---|---|
Capillary | HP-1 | 773. | Cavalli, Fernandez, et al., 2003 | 50. m/0.2 mm/0.33 μm, He, 60. C @ 5. min, 2. K/min, 250. C @ 20. min |
Capillary | HP-1 | 769. | Cavalli, Fernandez, et al., 2003 | 50. m/0.2 mm/0.33 μm, He, 60. C @ 5. min, 2. K/min, 250. C @ 20. min |
Capillary | HP-1 | 774. | Cavalli, Fernandez, et al., 2003 | 50. m/0.2 mm/0.33 μm, He, 60. C @ 5. min, 2. K/min, 250. C @ 20. min |

Van Den Dool and Kratz RI, non-polar column, custom temperature program

Column type | Active phase | I | Reference | Comment |
---|---|---|---|---|
Capillary | VF-5MS | 802.7 | Tret'yakov, 2007 | 30. m/0.25 mm/0.25 μm, He; Program: Multi-step temperature program; T(initial)=60C; T(final)=270C |
Capillary | BPX-5 | 818. | Elmore, Mottram, et al., 1997 | 50. m/0.32 mm/0.5 μm, He; Program: 0C (10min) => 40C/min => 40C (2min) => 4C/min => 280C |

Normal alkane RI, non-polar column, temperature ramp

Column type | Active phase | I | Reference | Comment |
---|---|---|---|---|
Capillary | HP-1 | 771. | Cavalli, Fernandez, et al., 2004 | 50. m/0.2 mm/0.33 μm, N2, 2. K/min, 250. C @ 20. min; Tstart: 60. C |

Normal alkane RI, polar column, custom temperature program

Column type | Active phase | I | Reference | Comment |
---|---|---|---|---|
Capillary | Carbowax 20M | 1146. | Acree and Arn, 2004 | Program: not specified |

References

Cavalli, Fernandez, et al., 2003
Cavalli, J.-F.; Fernandez, X.; Lizzani-Cuvelier, L.; Loiseau, A.-M.,
Comparison of static headspace, headspace solid phase microextraction, headspace sorptive extraction, and direct thermal desorption techniques on chemical composition of French olive oils,
J. Agric. Food Chem., 2003, 51, 26, 7709-7716, https://doi.org/10.1021/jf034834n
. [all data]
Tret'yakov, 2007
Tret'yakov, K.V.,
Retention Data. NIST Mass Spectrometry Data Center., NIST Mass Spectrometry Data Center, 2007. [all data]
Elmore, Mottram, et al., 1997
Elmore, J.S.; Mottram, D.S.; Enser, M.; Wood, J.D.,
Novel thiazoles and 3-thiazolines in cooked beef aroma,
J. Agric. Food Chem., 1997, 45, 9, 3603-3607, https://doi.org/10.1021/jf970066m
. [all data]
Cavalli, Fernandez, et al., 2004
Cavalli, J.-F.; Fernandez, X.; Lizzani-Cievelier, L.; Loiseau, A.-M.,
Characterization of volatile compounds of French and Spanish virgin olive oil by HS-SPME: identification of quality-freshness markers,
Food Chem., 2004, 88, 1, 151-157, https://doi.org/10.1016/j.foodchem.2004.04.003
. [all data]
Acree and Arn, 2004
Acree, T.; Arn, H.,
Flavornet, 2004, retrieved from http://www.flavornet.org/. [all data]