Benzene, 1-chloro-3-fluoro-2-methyl-
- Formula: C7H6ClF
- Molecular weight: 144.574
- IUPAC Standard InChIKey: FNPVYRJTBXHIPB-UHFFFAOYSA-N
- CAS Registry Number: 443-83-4
- Chemical structure:
View 3d structure (requires JavaScript / HTML 5) - Other names: 1-Chloro-3-fluoro-2-methylbenzene; 2-Chloro-6-fluorotoluene

Phase change data

Data compiled as indicated in comments:
BS - Robert L. Brown and Stephen E. Stein
AC - William E. Acree, Jr., James S. Chickos
Quantity | Value | Units | Method | Reference | Comment |
---|---|---|---|---|---|
Tboil | 428.2 | K | N/A | Weast and Grasselli, 1989 | BS |
Enthalpy of fusion
ΔfusH (kJ/mol) | Temperature (K) | Method | Reference | Comment |
---|---|---|---|---|
12.6 | 246. | DSC | Ahmed and Eades, 1972 | AC |

Van Den Dool and Kratz RI, non-polar column, temperature ramp

Column type | Active phase | I | Reference | Comment |
---|---|---|---|---|
Capillary | OV-1 | 927.5 | Gautzsch and Zinn, 1996 | 8. K/min; Tstart: 35. C; Tend: 300. C |
Capillary | OV-1 | 927.5 | Gautzsch and Zinn, 1996 | 8. K/min; Tstart: 35. C; Tend: 300. C |

References

Weast and Grasselli, 1989
CRC Handbook of Data on Organic Compounds, 2nd Editon, Weast,R.C and Grasselli, J.G., ed(s)., CRC Press, Inc., Boca Raton, FL, 1989, 1. [all data]
Ahmed and Eades, 1972
Ahmed, A.M.I.; Eades, R.G.,
Proton magnetic relaxation in toluene and some derivatives,
J. Chem. Soc., Faraday Trans. 2, 1972, 68, 1623, https://doi.org/10.1039/f29726801623
. [all data]
Gautzsch and Zinn, 1996
Gautzsch, R.; Zinn, P.,
Use of incremental models to estimate the retention indexes of aromatic compounds,
Chromatographia, 1996, 43, 3/4, 163-176, https://doi.org/10.1007/BF02292946
. [all data]