cyclohexylideneacetonitrile
- IUPAC Standard InChIKey: VLRQRRQHXZCEDL-UHFFFAOYSA-N
- CAS Registry Number: 4435-18-1
- Chemical structure:
View 3d structure (requires JavaScript / HTML 5) - Permanent link for this species. Use this link for bookmarking this species for future reference.

Reaction thermochemistry data

Data compiled by: Hussein Y. Afeefy, Joel F. Liebman, and Stephen E. Stein
Individual Reactions
By formula: C8H11N = cyclohexylideneacetonitrile
Quantity | Value | Units | Method | Reference | Comment |
---|---|---|---|---|---|
ΔrH° | -11. | kJ/mol | Eqk | Svata and Prochazka, 1975 | liquid phase; solvent: t-Butyl alcohol; Heat of isomerisation |

References

Svata and Prochazka, 1975
Svata, V.; Prochazka, M.,
Relative stability of alicyclic compounds containing an exocyclic and and endocyclic double bond,
Collect. Czech. Chem. Commun., 1975, 40, 2315-2325. [all data]