Nonadecane, 1-bromo-
- Formula: C19H39Br
- Molecular weight: 347.417
- IUPAC Standard InChIKey: GWESGLGUMMNXDU-UHFFFAOYSA-N
- CAS Registry Number: 4434-66-6
- Chemical structure:
View 3d structure (requires JavaScript / HTML 5) - Other names: Nonadecyl bromide; 1-Bromononadecane

Phase change data

Data compiled as indicated in comments:
TRC - Thermodynamics Research Center, NIST Boulder Laboratories, Chris Muzny director
AC - William E. Acree, Jr., James S. Chickos
Quantity | Value | Units | Method | Reference | Comment |
---|---|---|---|---|---|
Tfus | 310.9 | K | N/A | Cason, Wolfhagen, et al., 1949 | Uncertainty assigned by TRC = 4. K; TRC |
Enthalpy of vaporization
ΔvapH (kJ/mol) | Temperature (K) | Method | Reference | Comment |
---|---|---|---|---|
77.9 | 508. | A,EST | Stephenson and Malanowski, 1987 | Based on data from 493. to 673. K. See also Li and Rossini, 1961 and Dykyj and Vanko, 1970.; AC |

References

Cason, Wolfhagen, et al., 1949
Cason, J.; Wolfhagen, H.J.; Targey, W.; Adams, R.E.,
Branched-chain fatty acids: x synthesis of acids with branching methyl groups near the carboxyl,
J. Org. Chem., 1949, 14, 147-54. [all data]
Stephenson and Malanowski, 1987
Stephenson, Richard M.; Malanowski, Stanislaw,
Handbook of the Thermodynamics of Organic Compounds, 1987, https://doi.org/10.1007/978-94-009-3173-2
. [all data]
Li and Rossini, 1961
Li, J.C.M.; Rossini, F.D.,
Vapor Pressures and Boiling Points of the l-Fluoroalkanes, l-Chloroalkanes, l-Bromoalkanes, and l-Iodoalkanes, C 1 to C 20 .,
J. Chem. Eng. Data, 1961, 6, 2, 268-270, https://doi.org/10.1021/je60010a025
. [all data]
Dykyj and Vanko, 1970
Dykyj, J.; Vanko, A.,
Petrochemica, 1970, 10, 1, 3. [all data]