2,2',4,4',6,6'-Hexanitrobiphenyl
- Formula: C12H4N6O12
- Molecular weight: 424.1932
- IUPAC Standard InChIKey: PJTZYMXZEQWUHG-UHFFFAOYSA-N
- CAS Registry Number: 4433-16-3
- Chemical structure:
View 3d structure (requires JavaScript / HTML 5) - Permanent link for this species. Use this link for bookmarking this species for future reference.

Condensed phase thermochemistry data

Data compiled by: Hussein Y. Afeefy, Joel F. Liebman, and Stephen E. Stein
Quantity | Value | Units | Method | Reference | Comment |
---|---|---|---|---|---|
ΔfH°solid | 16.3 ± 2.0 | kcal/mol | Ccb | Rouse, 1976 | |
Quantity | Value | Units | Method | Reference | Comment |
ΔcH°solid | -1281.6 ± 0.9 | kcal/mol | Ccb | Rouse, 1976 |

References

Rouse, 1976
Rouse, P.E., Jr.,
Enthalpies of formation and calculated detonation properties of some thermally stable explosives,
J. Chem. Eng. Data, 1976, 21, 16-20. [all data]