1,1'-Biphenyl, 3,4-dimethyl-
- Formula: C14H14
- Molecular weight: 182.2610
- IUPAC Standard InChIKey: CKENDVLIAVMNDW-UHFFFAOYSA-N
- CAS Registry Number: 4433-11-8
- Chemical structure:
View 3d structure (requires JavaScript / HTML 5) - Other names: biphenyl, 3,4-dimethyl-; 3,4-dimethylbiphenyl

Phase change data

Data compiled by: Thermodynamics Research Center, NIST Boulder Laboratories, Chris Muzny director
Quantity | Value | Units | Method | Reference | Comment |
---|---|---|---|---|---|
Tboil | 555. | K | N/A | Ghigi, 1938 | Uncertainty assigned by TRC = 4. K |
Tboil | 555. | K | N/A | Ghigi, 1937 | Uncertainty assigned by TRC = 4. K |
Quantity | Value | Units | Method | Reference | Comment |
Tfus | 302.6 | K | N/A | Johnson, 1957 | Uncertainty assigned by TRC = 1.5 K |

Kovats' RI, non-polar column, isothermal

Column type | Active phase | Temperature (C) | I | Reference | Comment |
---|---|---|---|---|---|
Packed | Apiezon L | 170. | 1683. | Kríz, Popl, et al., 1974 | |
Packed | Apiezon L | 185. | 1697. | Kríz, Popl, et al., 1974 |

Kovats' RI, polar column, isothermal

Column type | Active phase | Temperature (C) | I | Reference | Comment |
---|---|---|---|---|---|
Capillary | SP-1000 | 185. | 2324. | Kríz, Popl, et al., 1974 | N2; Column length: 50. m; Column diameter: 0.25 mm |
Capillary | SP-1000 | 200. | 2279. | Kríz, Popl, et al., 1974 | N2; Column length: 50. m; Column diameter: 0.25 mm |

References

Ghigi, 1938
Ghigi, E.,
Chem. Ber., 1938, 71, 684. [all data]
Ghigi, 1937
Ghigi, E.,
Chem. Ber., 1937, 70, 2469. [all data]
Johnson, 1957
Johnson, E.A.,
J. Chem. Soc., 1957, 1957, 4155. [all data]
Kríz, Popl, et al., 1974
Kríz, J.; Popl, M.; Mostecký, J.,
Retention indices of biphenyls and diphenylalkanes,
J. Chromatogr., 1974, 97, 1, 3-13, https://doi.org/10.1016/S0021-9673(01)97577-6
. [all data]