2,3-Dimethyl-cyclohexa-1,3-diene
- Formula: C8H12
- Molecular weight: 108.1809
- IUPAC Standard InChIKey: LYIAPOCBDHFNSZ-UHFFFAOYSA-N
- CAS Registry Number: 4430-91-5
- Chemical structure:
View 3d structure (requires JavaScript / HTML 5) - Other names: 1,3-Cyclohexadiene, 2,3-dimethyl

Phase change data

Data compiled by: Thermodynamics Research Center, NIST Boulder Laboratories, Chris Muzny director
Quantity | Value | Units | Method | Reference | Comment |
---|---|---|---|---|---|
Tboil | 408.7 | K | N/A | Haworth, 1913 | Uncertainty assigned by TRC = 4. K |

Normal alkane RI, non-polar column, temperature ramp

Column type | Active phase | I | Reference | Comment |
---|---|---|---|---|
Capillary | OV-101 | 856. | Zenkevich, 2005 | 25. m/0.20 mm/0.10 μm, N2/He, 6. K/min; Tstart: 50. C; Tend: 250. C |

References

Haworth, 1913
Haworth, W.N.,
Catharene and Other Hydrodcarbons Allied to Terpenes,
J. Chem. Soc., 1913, 103, 1242. [all data]
Zenkevich, 2005
Zenkevich, I.G.,
Experimentally measured retention indices., 2005. [all data]