Carbonic acid dicyclohexyl ester
- Formula: C13H22O3
- Molecular weight: 226.3120
- IUPAC Standard InChIKey: FYIBPWZEZWVDQB-UHFFFAOYSA-N
- CAS Registry Number: 4427-97-8
- Chemical structure:
View 3d structure (requires JavaScript / HTML 5) - Permanent link for this species. Use this link for bookmarking this species for future reference.

Gas phase thermochemistry data

Data compiled by: Hussein Y. Afeefy, Joel F. Liebman, and Stephen E. Stein
Quantity | Value | Units | Method | Reference | Comment |
---|---|---|---|---|---|
ΔfH°gas | -764.0 ± 7.9 | kJ/mol | Ccb | Kiparisova and Rabinovich, 1971 |

Condensed phase thermochemistry data

Data compiled by: Hussein Y. Afeefy, Joel F. Liebman, and Stephen E. Stein
Quantity | Value | Units | Method | Reference | Comment |
---|---|---|---|---|---|
ΔfH°solid | -830.5 ± 5.9 | kJ/mol | Ccb | Kiparisova and Rabinovich, 1971 | |
Quantity | Value | Units | Method | Reference | Comment |
ΔcH°solid | -7429.5 ± 5.9 | kJ/mol | Ccb | Kiparisova and Rabinovich, 1971 | Corresponding ΔfHºsolid = -830.1 kJ/mol (simple calculation by NIST; no Washburn corrections) |

Phase change data

Data compiled as indicated in comments:
DRB - Donald R. Burgess, Jr.
AC - William E. Acree, Jr., James S. Chickos
Quantity | Value | Units | Method | Reference | Comment |
---|---|---|---|---|---|
ΔsubH° | 66.5 | kJ/mol | N/A | Kiparisova and Rabinovich, 1971 | DRB |
Enthalpy of sublimation
ΔsubH (kJ/mol) | Temperature (K) | Method | Reference | Comment |
---|---|---|---|---|
66.5 ± 4.2 | 303. | ME | Kiparisova and Rabinovich, 1971, 2 | Based on data from 293. to 313. K. See also Pedley and Rylance, 1977.; AC |

References

Kiparisova and Rabinovich, 1971
Kiparisova, E.G.; Rabinovich, I.B.,
Thermochemistry of a series of acyl peroxides,
Dokl. Phys. Chem. (Engl. Transl.), 1971, 199, 675-677, In original 1075. [all data]
Kiparisova and Rabinovich, 1971, 2
Kiparisova, E.G.; Rabinovich, I.B.,
Dokl. Akad. Nauk SSSR, 1971, 199, 5, 1075. [all data]
Pedley and Rylance, 1977
Pedley, J.B.; Rylance, J.,
, Computer Analysed Thermochemical Data: Organic and Organometallic Compounds, University of Sussex, Brighton, 1977. [all data]