Phenol, 4-methyl-2-(1-methylethyl)-
- Formula: C10H14O
- Molecular weight: 150.2176
- IUPAC Standard InChIKey: DSTPUJAJSXTJHM-UHFFFAOYSA-N
- CAS Registry Number: 4427-56-9
- Chemical structure:
View 3d structure (requires JavaScript / HTML 5) - Other names: 2-Isopropyl-4-methylphenol; 4-Methyl-2-isopropylphenol (Isothymol); Isothymol; 2-isopropyl-p-cresol

Gas phase thermochemistry data

Data compiled by: Hussein Y. Afeefy, Joel F. Liebman, and Stephen E. Stein
Quantity | Value | Units | Method | Reference | Comment |
---|---|---|---|---|---|
ΔfH°gas | -198.4 | kJ/mol | Ccb | Bertholon, Giray, et al., 1971 |

Condensed phase thermochemistry data

Data compiled by: Hussein Y. Afeefy, Joel F. Liebman, and Stephen E. Stein
Quantity | Value | Units | Method | Reference | Comment |
---|---|---|---|---|---|
ΔfH°liquid | -280. | kJ/mol | Ccb | Bertholon, Giray, et al., 1971 | |
Quantity | Value | Units | Method | Reference | Comment |
ΔcH°liquid | -5661. | kJ/mol | Ccb | Bertholon, Giray, et al., 1971 | Corresponding ΔfHºliquid = -280. kJ/mol (simple calculation by NIST; no Washburn corrections) |

Phase change data

Data compiled as indicated in comments:
TRC - Thermodynamics Research Center, NIST Boulder Laboratories, Chris Muzny director
ALS - Hussein Y. Afeefy, Joel F. Liebman, and Stephen E. Stein
DRB - Donald R. Burgess, Jr.
Quantity | Value | Units | Method | Reference | Comment |
---|---|---|---|---|---|
Tboil | 507.65 | K | N/A | Sowa, Hinton, et al., 1932 | Uncertainty assigned by TRC = 4. K; TRC |
Quantity | Value | Units | Method | Reference | Comment |
Tfus | 308.15 | K | N/A | Dewar and Puttnam, 1959 | Uncertainty assigned by TRC = 2. K; TRC |
Tfus | 310.15 | K | N/A | Karr, 1957 | Uncertainty assigned by TRC = 2. K; TRC |
Tfus | 306.65 | K | N/A | Stroh, Seydel, et al., 1957 | Uncertainty assigned by TRC = 2. K; TRC |
Tfus | 309.65 | K | N/A | Carpenter and Easter, 1955 | Uncertainty assigned by TRC = 2. K; TRC |
Tfus | 309.15 | K | N/A | Guillaumin, 1910 | Uncertainty assigned by TRC = 2. K; TRC |
Quantity | Value | Units | Method | Reference | Comment |
ΔvapH° | 77.74 | kJ/mol | C | Bertholon, Giray, et al., 1971 | ALS |
ΔvapH° | 81.6 | kJ/mol | N/A | Bertholon, Giray, et al., 1971 | DRB |

References

Bertholon, Giray, et al., 1971
Bertholon, G.; Giray, M.; Perrin, R.; Vincent-Falquet-Berny, M.F.,
No. 532. - Etude physicochimique des phenols. OX. - Ethanlpies de combustion et energies de resonance des alcoyl et aryphenols,
Bull. Soc. Chim. France, 1971, 3180-3187. [all data]
Sowa, Hinton, et al., 1932
Sowa, F.J.; Hinton, H.D.; Nieuwland, J.A.,
Organic Reactions with Boron FLuoride II. The Rearrangement of Alkyl Phenyl Ethers,
J. Am. Chem. Soc., 1932, 54, 2019. [all data]
Dewar and Puttnam, 1959
Dewar; Puttnam,
J. Chem. Soc., 1959, 1959, 4086. [all data]
Karr, 1957
Karr, C.,
, U. S. Bur. Mines, Inform. Circ. IC 7802, 1957. [all data]
Stroh, Seydel, et al., 1957
Stroh, R.; Seydel, R.; Hahn, W.,
Alkylation of phenols with olefins.,
Angew. Chem., 1957, 69, 699. [all data]
Carpenter and Easter, 1955
Carpenter; Easter,
J. Org. Chem., 1955, 20, 401. [all data]
Guillaumin, 1910
Guillaumin, C.,
Bull. Soc. Chim. Fr., 1910, 7, 332. [all data]