Butylmethyldiazene
- Formula: C5H12N2
- Molecular weight: 100.1622
- IUPAC Standard InChIKey: GKQMCKLMLLVAAI-VOTSOKGWSA-N
- CAS Registry Number: 4426-46-4
- Chemical structure:
View 3d structure (requires JavaScript / HTML 5) - Permanent link for this species. Use this link for bookmarking this species for future reference.

Gas phase thermochemistry data

Data compiled by: Hussein Y. Afeefy, Joel F. Liebman, and Stephen E. Stein
Quantity | Value | Units | Method | Reference | Comment |
---|---|---|---|---|---|
ΔfH°gas | 78.9 ± 2.2 | kJ/mol | Ccr | Engel, Montgomery, et al., 1978 |

Condensed phase thermochemistry data

Data compiled by: Hussein Y. Afeefy, Joel F. Liebman, and Stephen E. Stein
Quantity | Value | Units | Method | Reference | Comment |
---|---|---|---|---|---|
ΔfH°liquid | 42.5 ± 2.2 | kJ/mol | Ccr | Engel, Montgomery, et al., 1978 | |
Quantity | Value | Units | Method | Reference | Comment |
ΔcH°liquid | -3725. ± 2. | kJ/mol | Ccr | Engel, Montgomery, et al., 1978 |

Phase change data

Data compiled as indicated in comments:
ALS - Hussein Y. Afeefy, Joel F. Liebman, and Stephen E. Stein
DRB - Donald R. Burgess, Jr.
AC - William E. Acree, Jr., James S. Chickos
Quantity | Value | Units | Method | Reference | Comment |
---|---|---|---|---|---|
ΔvapH° | 36.4 ± 0.2 | kJ/mol | V | Engel, Montgomery, et al., 1978 | ALS |
ΔvapH° | 36.4 | kJ/mol | N/A | Engel, Montgomery, et al., 1978 | DRB |
ΔvapH° | 36.4 ± 0.2 | kJ/mol | C | Engel, Montgomery, et al., 1978 | AC |

References

Engel, Montgomery, et al., 1978
Engel, P.S.; Montgomery, R.L.; Mansson, M.; Leckonby, R.A.; Foyt, H.L.; Rossini, F.D.,
Enthalpies of combustion, vaporization, and formation of methyl-n-butyldiazene and di-n-butyldiazene,
J. Chem. Thermodyn., 1978, 10, 205-211. [all data]