9H-Fluorene, 9-methylene-
- Formula: C14H10
- Molecular weight: 178.2292
- IUPAC Standard InChIKey: ZYASLTYCYTYKFC-UHFFFAOYSA-N
- CAS Registry Number: 4425-82-5
- Chemical structure:
View 3d structure (requires JavaScript / HTML 5) - Other names: 9-Methylene-fluorene; 9-Methylene-9H-fluorene; 9-Methylidene-9H-fluorene

Lee's RI, non-polar column, temperature ramp

Column type | Active phase | I | Reference | Comment |
---|---|---|---|---|
Capillary | HP-5 | 292.4 | Wang, Hou, et al., 2007 | 30. m/0.30 mm/0.25 μm, Helium, 50. C @ 5. min, 5. K/min, 200. C @ 15. min |

Lee's RI, non-polar column, custom temperature program

Column type | Active phase | I | Reference | Comment |
---|---|---|---|---|
Capillary | HP-5MS | 292.28 | Wang, Li, et al., 2007 | 30. m/0.25 mm/0.25 μm, He; Program: 60C(2min) => 6C/min => 258C => 2C/min => 300C(4min) |
Capillary | HP-5MS | 292.28 | Wang, Li, et al., 2007, 2 | 30. m/0.25 mm/0.25 μm, He; Program: not specified |
Capillary | DB-5MS | 279.3 | Aracil, Font, et al., 2005 | Column length: 60. m; Column diameter: 0.25 mm; Program: not specified |

References

Wang, Hou, et al., 2007
Wang, G.; Hou, Z.; Sun, Y.; Liu, Y.; Xie, B.; Liu, S.,
Investigation of pyrolysis behavior of fenoxycarb using PY-GC-MS assisted with chemometric methods,
Chem. Anal., 2007, 52, 141-156. [all data]
Wang, Li, et al., 2007
Wang, Z.; Li, K.; Lambert, P.; Yang, C.,
Identification, characterization and quantitation of pyrogenic polycylic aromatic hydrocarbons and other organic compounds in tire fire products,
J. Chromatogr. A, 2007, 1139, 1, 14-26, https://doi.org/10.1016/j.chroma.2006.10.085
. [all data]
Wang, Li, et al., 2007, 2
Wang, Z.; Li, K.; Lambert, P.; Brown, C.E.; Yang, C.; Hollebone, B.P.,
Identification and characterization of polycyclic aromatic compounds in tire fire products and differentiation of pyrogenic PAHs from petrogenic PAHs
in Proceedings of the 30th Arctic and Marine Oilspill (AMOP) Technical Seminar. Vol.1, 2007, 61-85. [all data]
Aracil, Font, et al., 2005
Aracil, I.; Font, R.; Conesa, J.A.,
Semivolatile and volatile compounds from the pyrolysis and combustion of polyvinyl chloride,
J. Anal. Appl. Pyrolysis, 2005, 74, 1-2, 465-478, https://doi.org/10.1016/j.jaap.2004.09.008
. [all data]