1,3,5-Benzenetricarbonyl trichloride
- Formula: C9H3Cl3O3
- Molecular weight: 265.477
- IUPAC Standard InChIKey: UWCPYKQBIPYOLX-UHFFFAOYSA-N
- CAS Registry Number: 4422-95-1
- Chemical structure:
View 3d structure (requires JavaScript / HTML 5) - Other names: Trimesoyl chloride; 1,3,5-Benzenetricarboxylic acid chloride; 1,3,5-Benzenetricarbonyl chloride; Benzenetricarbonyl chloride; Trimesic acid trichloride; 1,3,5-Benzenetricarboxylic chloride; benzene-1,3,5-tricarbonyl trichloride

Phase change data

Data compiled by: Robert L. Brown and Stephen E. Stein
Reduced pressure boiling point
Tboil (K) | Pressure (bar) | Reference |
---|---|---|
458. to 460. | 0.019 | Frinton Laboratories Inc., 1986 |

References

Frinton Laboratories Inc., 1986
Frinton Laboratories Inc.,
Catalog Number 11, Frinton Laboratories Inc., Vineland, NJ, 1986, 99. [all data]