1H-Tetrazol-5-amine
- Formula: CH3N5
- Molecular weight: 85.0680
- IUPAC Standard InChIKey: ULRPISSMEBPJLN-UHFFFAOYSA-N
- CAS Registry Number: 4418-61-5
- Chemical structure:
View 3d structure (requires JavaScript / HTML 5) - Other names: 1H-Tetrazole, 5-amino-; 5-Amino-1,2,3,4-tetrazole; 5-Amino-1H-tetrazole; 5-Aminotetrazole; Tetrazole, 5-amino-; 1H-Tetrazol-5-ylamine; 5-Tetrazolamine; 5-Amino-2H-tetrazole; 2H-Tetrazol-5-amine; Aminotetrazole; NSC 3004; tetrazol-5-ylamine

Condensed phase thermochemistry data

Data compiled by: Hussein Y. Afeefy, Joel F. Liebman, and Stephen E. Stein
Quantity | Value | Units | Method | Reference | Comment |
---|---|---|---|---|---|
ΔfH°solid | 207.8 | kJ/mol | Ccb | McEwan and Rigg, 1951 | |
Quantity | Value | Units | Method | Reference | Comment |
ΔcH°solid | -1069.13 | kJ/mol | Ccb | Handrick, 1956 | |
ΔcH°solid | -1030.1 ± 2.3 | kJ/mol | Ccb | McEwan and Rigg, 1951 |

Phase change data

Data compiled by: William E. Acree, Jr., James S. Chickos
Enthalpy of sublimation
ΔsubH (kJ/mol) | Temperature (K) | Method | Reference |
---|---|---|---|
112.6 ± 1.2 | 383. to 443. | ME | Kozyro, Simirskii, et al., 1990 |

References

McEwan and Rigg, 1951
McEwan, W.S.; Rigg, M.W.,
The heats of combustion of compounds containing the tetrazole ring,
J. Am. Chem. Soc., 1951, 73, 4725-4727. [all data]
Handrick, 1956
Handrick, G.R.,
Report of the study of pure explosive compounds. Part IV. Calculation of heat of combustion of organic compounds from structural features and calculation of power of high explosives, Rpt. C-58247 for the Office of the Chief of Ordnance, contract DA-19-020-ORD-47 by the Arthur D. Little, Inc., Cambridge, MA, 1956, 467-573. [all data]
Kozyro, Simirskii, et al., 1990
Kozyro, A.A.; Simirskii, V.V.; Krasulin, A.P.; Sevruk, V.M.; Kabo, G.Y.; Frenkel, M.L.; Gaponik, P.N.; Grigor'ev, Y.V.,
Russ. J. Phys. Chem., 1990, 64, 348. [all data]