1,1-Dimethoxybutane
- Formula: C6H12O2
- Molecular weight: 116.1583
- IUPAC Standard InChIKey: DZKUKLGGGNLHNY-UHFFFAOYSA-N
- CAS Registry Number: 4415-90-1
- Chemical structure:
View 3d structure (requires JavaScript / HTML 5) - Species with the same structure:

Gas phase thermochemistry data

Data compiled by: Hussein Y. Afeefy, Joel F. Liebman, and Stephen E. Stein
Quantity | Value | Units | Method | Reference | Comment |
---|---|---|---|---|---|
ΔfH°gas | -309. ± 2. | kJ/mol | Cm | Wiberg, Morgan, et al., 1994 |

Condensed phase thermochemistry data

Data compiled by: Hussein Y. Afeefy, Joel F. Liebman, and Stephen E. Stein
Quantity | Value | Units | Method | Reference | Comment |
---|---|---|---|---|---|
ΔfH°liquid | -351. ± 1. | kJ/mol | Cm | Wiberg, Morgan, et al., 1994 |

Phase change data

Data compiled by: William E. Acree, Jr., James S. Chickos
Quantity | Value | Units | Method | Reference | Comment |
---|---|---|---|---|---|
ΔvapH° | 42.0 ± 0.3 | kJ/mol | GS | Verevkin, 2002 | Based on data from 274. to 313. K. |
Enthalpy of vaporization
ΔvapH (kJ/mol) | Temperature (K) | Method | Reference | Comment |
---|---|---|---|---|
42.3 ± 0.3 | 273. to 313. | GS | Verevkin, Peng, et al., 1998 | |
42.6 | 325. | EB | Wiberg, Morgan, et al., 1994 | Based on data from 301. to 348. K. |

Reaction thermochemistry data

Data compiled by: Hussein Y. Afeefy, Joel F. Liebman, and Stephen E. Stein
Individual Reactions
By formula: C6H12O2 + H2O = C4H6O + 2CH4O
Quantity | Value | Units | Method | Reference | Comment |
---|---|---|---|---|---|
ΔrH° | 25.4 ± 0.3 | kJ/mol | Cm | Wiberg, Morgan, et al., 1994 | liquid phase |
By formula: C4H6O + 2CH4O = C6H12O2 + H2O
Quantity | Value | Units | Method | Reference | Comment |
---|---|---|---|---|---|
ΔrH° | -52.7 ± 1.7 | kJ/mol | Cm | Wiberg, Morgan, et al., 1994 | gas phase |

References

Wiberg, Morgan, et al., 1994
Wiberg, K.B.; Morgan, K.M.; Maltz, H.,
Thermochemistry of carbonyl reactions. 6. A study of hydration equilibria,
J. Am. Chem. Soc., 1994, 116, 11067-11077. [all data]
Verevkin, 2002
Verevkin, Sergey P.,
Improved Benson Increments for the Estimation of Standard Enthalpies of Formation and Enthalpies of Vaporization of Alkyl Ethers, Acetals, Ketals, and Ortho Esters,
J. Chem. Eng. Data, 2002, 47, 5, 1071-1097, https://doi.org/10.1021/je020023o
. [all data]
Verevkin, Peng, et al., 1998
Verevkin, S.P.; Peng, W.-H.; Beckhaus, H.D.; Rücuardt, C.,
Geminal substituent effects. 16. Does the anomeric effect in ketals depend on the hybridization of the central carbon atom?,
Eur. J. Org. Chem., 1998, 11, 2323. [all data]