Cyclopentane, 1,1'-ethylidenebis-
- Formula: C12H22
- Molecular weight: 166.3031
- IUPAC Standard InChIKey: XWKIKXOZAGBKSO-UHFFFAOYSA-N
- CAS Registry Number: 4413-21-2
- Chemical structure:
View 3d structure (requires JavaScript / HTML 5) - Other names: Ethane, 1,1-dicyclopentyl-; 1,1-Dicyclopentylethane

Phase change data

Data compiled by: Thermodynamics Research Center, NIST Boulder Laboratories, Chris Muzny director
Quantity | Value | Units | Method | Reference | Comment |
---|---|---|---|---|---|
Tfus | 153.15 | K | N/A | Anonymous, 1968 | Glass phase; Uncertainty assigned by TRC = 1. K |

References

Anonymous, 1968
Anonymous, R.,
Properties of hydrocarbon of high molecular weight, Am. Pet. Inst. Res. Proj. 42, Penn. State Univ., 1968. [all data]