Benzene, (1-cyclohexylethyl)-
- Formula: C14H20
- Molecular weight: 188.3086
- IUPAC Standard InChIKey: HNBJZFPJDFJMLP-UHFFFAOYSA-N
- CAS Registry Number: 4413-16-5
- Chemical structure:
View 3d structure (requires JavaScript / HTML 5) - Other names: Ethane, 1-cyclohexyl-1-phenyl-; (α-Methylbenzyl)cyclohexane; 1-Phenyl-1-cyclohexylethane; 1-Cyclohexyl-1-phenylethane

Phase change data

Data compiled as indicated in comments:
TRC - Thermodynamics Research Center, NIST Boulder Laboratories, Chris Muzny director
AC - William E. Acree, Jr., James S. Chickos
Quantity | Value | Units | Method | Reference | Comment |
---|---|---|---|---|---|
Tfus | 219.26 | K | N/A | Anonymous, 1968 | Uncertainty assigned by TRC = 0.27 K; TRC |
Enthalpy of vaporization
ΔvapH (kJ/mol) | Temperature (K) | Method | Reference | Comment |
---|---|---|---|---|
70.8 | 374. | A,MG | Stephenson and Malanowski, 1987 | Based on data from 359. to 400. K. See also Schiessler and Whitmore, 1955.; AC |

References

Anonymous, 1968
Anonymous, R.,
Properties of hydrocarbon of high molecular weight, Am. Pet. Inst. Res. Proj. 42, Penn. State Univ., 1968. [all data]
Stephenson and Malanowski, 1987
Stephenson, Richard M.; Malanowski, Stanislaw,
Handbook of the Thermodynamics of Organic Compounds, 1987, https://doi.org/10.1007/978-94-009-3173-2
. [all data]
Schiessler and Whitmore, 1955
Schiessler, R.W.; Whitmore, F.C.,
Properties of High Molecular Weight Hydrocarbons,
Ind. Eng. Chem., 1955, 47, 8, 1660-1665, https://doi.org/10.1021/ie50548a054
. [all data]