Phenethyl mercaptan
- Formula: C8H10S
- Molecular weight: 138.230
- IUPAC Standard InChIKey: ZMRFRBHYXOQLDK-UHFFFAOYSA-N
- CAS Registry Number: 4410-99-5
- Chemical structure:
View 3d structure (requires JavaScript / HTML 5) - Other names: 2-Phenylethanethiol; β-Phenylethyl mercaptan; 2-Phenylethyl mercaptan; Benzeneethanethiol; Phenylethylthiol; 2-Phenylethylthiol

Van Den Dool and Kratz RI, non-polar column, temperature ramp

Column type | Active phase | I | Reference | Comment |
---|---|---|---|---|
Capillary | DB-1 | 1147. | Rochat S., de Saint Laumer J.Y., et al., 2007 | 20. m/0.18 mm/0.18 μm, 60. C @ 3. min, 8. K/min, 220. C @ 5. min |
Capillary | DB-1 | 1147. | Rochat S., de Saint Laumer J.Y., et al., 2007 | 20. m/0.18 mm/0.18 μm, 60. C @ 3. min, 8. K/min, 220. C @ 5. min |

Normal alkane RI, non-polar column, custom temperature program

Column type | Active phase | I | Reference | Comment |
---|---|---|---|---|
Capillary | DB-5 | 1176. | Schieberle, 1996 | Column length: 30. m; Column diameter: 0.32 mm; Program: not specified |

References

Rochat S., de Saint Laumer J.Y., et al., 2007
Rochat S.; de Saint Laumer J.Y.; Chaintreau A.,
Analysis of sulfur compounds from the in-oven roast beef aroma by comprehensive two-dimensional gas chromatography,
J. Chromatogr. A, 2007, 1147, 1, 85-94, https://doi.org/10.1016/j.chroma.2007.02.039
. [all data]
Schieberle, 1996
Schieberle, P.,
Odour-active compounds in moderately roasted sesame,
Food Chem., 1996, 55, 2, 145-152, https://doi.org/10.1016/0308-8146(95)00095-X
. [all data]