2-Propen-1-ol, 3-phenyl-, (E)-
- Formula: C9H10O
- Molecular weight: 134.1751
- IUPAC Standard InChIKey: OOCCDEMITAIZTP-QPJJXVBHSA-N
- CAS Registry Number: 4407-36-7
- Chemical structure:
View 3d structure (requires JavaScript / HTML 5) - Stereoisomers:
- Other names: (E)-3-Phenylprop-2-en-1-ol; (E)-cinnamyl alcohol; trans-Cinnamyl alcohol; E-Cinnamic alcohol

Phase change data

Data compiled as indicated in comments:
BS - Robert L. Brown and Stephen E. Stein
AC - William E. Acree, Jr., James S. Chickos
Quantity | Value | Units | Method | Reference | Comment |
---|---|---|---|---|---|
Tboil | 530.7 | K | N/A | Weast and Grasselli, 1989 | BS |
Enthalpy of sublimation
ΔsubH (kJ/mol) | Temperature (K) | Method | Reference | Comment |
---|---|---|---|---|
109.6 | 297.5 | A | Stephenson and Malanowski, 1987 | Based on data from 288. to 307. K.; AC |

Normal alkane RI, polar column, temperature ramp

Data compiled by: NIST Mass Spectrometry Data Center, William E. Wallace, director

Column type CapillaryCapillary
Active phase DB-WaxDB-Wax
Column length (m) 30.30.
Carrier gas HeHe
Substrate
Column diameter (mm) 0.250.25
Phase thickness (μm) 0.250.25
Tstart (C) 50.50.
Tend (C) 220.220.
Heat rate (K/min) 4.4.
Initial hold (min) 4.4.
Final hold (min) 20.20.
I 2263.2289.
ReferenceOsorio, Duque, et al., 2002Osorio, Duque, et al., 2002
Comment MSDC-RI MSDC-RI

Kovats' RI, polar column, temperature ramp

Data compiled by: NIST Mass Spectrometry Data Center, William E. Wallace, director

Column type Capillary
Active phase Supelcowax-10
Column length (m) 60.
Carrier gas He
Substrate
Column diameter (mm) 0.25
Phase thickness (μm)
Tstart (C) 35.
Tend (C) 200.
Heat rate (K/min) 3.
Initial hold (min) 5.
Final hold (min) 20.
I 2334.
ReferenceWong and Teng, 1994
Comment MSDC-RI

References

Weast and Grasselli, 1989
CRC Handbook of Data on Organic Compounds, 2nd Editon, Weast,R.C and Grasselli, J.G., ed(s)., CRC Press, Inc., Boca Raton, FL, 1989, 1. [all data]
Stephenson and Malanowski, 1987
Stephenson, Richard M.; Malanowski, Stanislaw,
Handbook of the Thermodynamics of Organic Compounds, 1987, https://doi.org/10.1007/978-94-009-3173-2
. [all data]