2,4-dimethyl-2-phenylpentane
- Formula: C13H20
- Molecular weight: 176.2979
- IUPAC Standard InChIKey: OHNGNROSSCLLCF-UHFFFAOYSA-N
- CAS Registry Number: 4406-52-4
- Chemical structure:
View 3d structure (requires JavaScript / HTML 5) - Permanent link for this species. Use this link for bookmarking this species for future reference.

Phase change data

Data compiled by: Thermodynamics Research Center, NIST Boulder Laboratories, Chris Muzny director
Quantity | Value | Units | Method | Reference | Comment |
---|---|---|---|---|---|
Tboil | 488.15 | K | N/A | Pines and Mark, 1956 | Uncertainty assigned by TRC = 2. K |

References

Pines and Mark, 1956
Pines, H.; Mark, V.,
Carbanions Additions in the Reaction of Aromatic Hydrocarbons with Monoolefins,
J. Am. Chem. Soc., 1956, 78, 4316. [all data]