1,3-Dioxolane, 2-methyl-2-(1-methylethyl)-
- Formula: C7H14O2
- Molecular weight: 130.1849
- IUPAC Standard InChIKey: IGZQZZODNMBJLU-UHFFFAOYSA-N
- CAS Registry Number: 4405-16-7
- Chemical structure:
View 3d structure (requires JavaScript / HTML 5) - Other names: 1,3-Dioxolane, 2-isopropyl-2-methyl-; 2-Methyl-2-isopropyl-1,3-dioxolane

Phase change data

Data compiled by: William E. Acree, Jr., James S. Chickos
Quantity | Value | Units | Method | Reference | Comment |
---|---|---|---|---|---|
ΔvapH° | 43.9 ± 0.2 | kJ/mol | GS | Verevkin, 2002 | Based on data from 274. to 303. K. |
ΔvapH° | 44.6 ± 0.2 | kJ/mol | GS | Verevkin, Peng, et al., 1998 | Based on data from 273. to 303. K. |

References

Verevkin, 2002
Verevkin, Sergey P.,
Improved Benson Increments for the Estimation of Standard Enthalpies of Formation and Enthalpies of Vaporization of Alkyl Ethers, Acetals, Ketals, and Ortho Esters,
J. Chem. Eng. Data, 2002, 47, 5, 1071-1097, https://doi.org/10.1021/je020023o
. [all data]
Verevkin, Peng, et al., 1998
Verevkin, S.P.; Peng, W.-H.; Beckhaus, H.D.; Rücuardt, C.,
Geminal substituent effects. 16. Does the anomeric effect in ketals depend on the hybridization of the central carbon atom?,
Eur. J. Org. Chem., 1998, 11, 2323. [all data]