Ethane, 1,1'-[methylenebis(thio)]bis-
- Formula: C5H12S2
- Molecular weight: 136.279
- IUPAC Standard InChIKey: RJQVVQDWHKZIHU-UHFFFAOYSA-N
- CAS Registry Number: 4396-19-4
- Chemical structure:

Kovats' RI, non-polar column, isothermal

Column type | Active phase | Temperature (C) | I | Reference | Comment |
---|---|---|---|---|---|
Packed | Apiezon M | 130. | 1054. | Garbuzov, Misharina, et al., 1985 | He or N2, Chromosorb W, AW-DMCS; Column length: 2.1 m |

Normal alkane RI, non-polar column, custom temperature program

Column type | Active phase | I | Reference | Comment |
---|---|---|---|---|
Packed | Apiezon M | 1055. | Golovnya, Misharina, et al., 1983 | N2, Chromosorb W AW/DMCS; Column length: 5.6 m; Program: 60C(7min), 100C(7min), 150C isothermal |

Phase change data

Data compiled as indicated in comments:
ALS - Hussein Y. Afeefy, Joel F. Liebman, and Stephen E. Stein
DRB - Donald R. Burgess, Jr.
Quantity | Value | Units | Method | Reference | Comment |
---|---|---|---|---|---|
ΔvapH° | 12.1 | kcal/mol | N/A | Majer and Svoboda, 1985 | |
ΔvapH° | 12.14 ± 0.038 | kcal/mol | C | Mansson, 1974 | ALS |
ΔvapH° | 12.1 | kcal/mol | N/A | Mansson, 1974 | DRB |

References

Garbuzov, Misharina, et al., 1985
Garbuzov, V.G.; Misharina, T.A.; Aerov, A.F.; Golovnya, R.V.,
Gas chromatographic retention indices for sulphur(II)-containing organic substances,
J. Anal. Chem. USSR (Engl. Transl.), 1985, 40, 4, 576-586. [all data]
Golovnya, Misharina, et al., 1983
Golovnya, R.V.; Misharina, T.A.; Garbuzov, V.G.; Medvedyev, F.A.,
Volatile sulfur containing compounds in simulated meat flavour and their comparison with the constituents of natural aroma,
Nahrung, 1983, 27, 3, 237-249, https://doi.org/10.1002/food.19830270314
. [all data]