Benzene, 2-chloro-1-methyl-4-(1-methylethyl)-
- Formula: C10H13Cl
- Molecular weight: 168.663
- IUPAC Standard InChIKey: JVIGKRUGGYKFSL-UHFFFAOYSA-N
- CAS Registry Number: 4395-79-3
- Chemical structure:
View 3d structure (requires JavaScript / HTML 5) - Other names: p-Cymene, 2-chloro-; Carvacryl chloride; Septol; 2-Chloro-4-isopropyltoluene; 2-Chlorocymol

Phase change data

Data compiled as indicated in comments:
TRC - Thermodynamics Research Center, NIST Boulder Laboratories, Chris Muzny director
AC - William E. Acree, Jr., James S. Chickos
Quantity | Value | Units | Method | Reference | Comment |
---|---|---|---|---|---|
Tboil | 490.75 | K | N/A | Kobe, Okabe, et al., 1941 | Uncertainty assigned by TRC = 0.5 K; TRC |
Enthalpy of vaporization
ΔvapH (kJ/mol) | Temperature (K) | Method | Reference | Comment |
---|---|---|---|---|
49.3 | 415. | A | Stephenson and Malanowski, 1987 | Based on data from 400. to 490. K. See also Dykyj and Vanko, 1970 and Dykyj, Svoboda, et al., 1999.; AC |

References

Kobe, Okabe, et al., 1941
Kobe, K.A.; Okabe, T.S.; Ramstad, M.T.; Huemmer, P.M.,
p-Cymene Studies. VI. Vapor Pressure of p-Cymene, Some of its Derivatives and Related Compounds,
J. Am. Chem. Soc., 1941, 63, 3251. [all data]
Stephenson and Malanowski, 1987
Stephenson, Richard M.; Malanowski, Stanislaw,
Handbook of the Thermodynamics of Organic Compounds, 1987, https://doi.org/10.1007/978-94-009-3173-2
. [all data]
Dykyj and Vanko, 1970
Dykyj, J.; Vanko, A.,
Petrochemica, 1970, 10, 1, 3. [all data]
Dykyj, Svoboda, et al., 1999
Dykyj, J.; Svoboda, J.; Wilhoit, R.C.; Frenkel, M.L.; Hall, K.R.,
Vapor Pressure of Chemicals: Part A. Vapor Pressure and Antoine Constants for Hydrocarbons and Sulfur, Selenium, Tellurium and Hydrogen Containing Organic Compounds, Springer, Berlin, 1999, 373. [all data]