1-amino-4-(phenylamino)anthraquinone
- Formula: C20H14N2O2
- Molecular weight: 314.3374
- IUPAC Standard InChIKey: XUDJOVURIXHNRW-UHFFFAOYSA-N
- CAS Registry Number: 4395-65-7
- Chemical structure:
View 3d structure (requires JavaScript / HTML 5) - Other names: 1-Anilino-4-aminoanthraquinone

Phase change data

Data compiled by: William E. Acree, Jr., James S. Chickos
Enthalpy of sublimation
ΔsubH (kJ/mol) | Temperature (K) | Method | Reference | Comment |
---|---|---|---|---|
135.1 | 473. to 553. | GS | NISHIDA, ISHIHARA, et al., 2008 | See also Nishida, Ishihara, et al., 1978. |

References

NISHIDA, ISHIHARA, et al., 2008
NISHIDA, K.; ISHIHARA, E.; OSAKA, T.; KOUKITU, M.,
Vapour Pressures and Heats of Sublimation of Some Disperse Dyes,
J Food Science, 2008, 93, 2, 52-54, https://doi.org/10.1111/j.1478-4408.1977.tb03324.x
. [all data]
Nishida, Ishihara, et al., 1978
Nishida, K.; Ishihara, E.; Osaka, T.; Koukitu, M.,
Vapor pressures and heats of sublimation of some disperse dyes,
Galaxia, 1978, 72, 13. [all data]