N-Formylmorpholine
- Formula: C5H9NO2
- Molecular weight: 115.1305
- IUPAC Standard InChIKey: LCEDQNDDFOCWGG-UHFFFAOYSA-N
- CAS Registry Number: 4394-85-8
- Chemical structure:
View 3d structure (requires JavaScript / HTML 5) - Other names: 4-Formylmorpholine; 4-Morpholinecarboxaldehyde; Morpholine, 4-formyl-; N-Formylmorfolin; 4-morpholinecarbaldehyde

Phase change data

Data compiled as indicated in comments:
BS - Robert L. Brown and Stephen E. Stein
AC - William E. Acree, Jr., James S. Chickos
Quantity | Value | Units | Method | Reference | Comment |
---|---|---|---|---|---|
Tboil | 509.7 | K | N/A | Weast and Grasselli, 1989 | BS |
Reduced pressure boiling point
Tboil (K) | Pressure (bar) | Reference | Comment |
---|---|---|---|
385. to 389. | 0.020 | Frinton Laboratories Inc., 1986 | BS |
Enthalpy of vaporization
ΔvapH (kJ/mol) | Temperature (K) | Method | Reference | Comment |
---|---|---|---|---|
52.7 | 399. | TGA | Al-Najjar and Al-Sammerrai, 2007 | Based on data from 375. to 423. K.; AC |
56.9 | 416. | N/A | Park and Gmehling, 1989 | AC |

Normal alkane RI, non-polar column, custom temperature program

Column type | Active phase | I | Reference | Comment |
---|---|---|---|---|
Capillary | BPX-5 | 1133. | Machiels, van Ruth, et al., 2003 | 60. m/0.32 mm/1. μm, He; Program: 40C (4min) => 2C/min => 90C => 4C/min => 130C => 8C/min => 250 C (10min) |

References

Weast and Grasselli, 1989
CRC Handbook of Data on Organic Compounds, 2nd Editon, Weast,R.C and Grasselli, J.G., ed(s)., CRC Press, Inc., Boca Raton, FL, 1989, 1. [all data]
Frinton Laboratories Inc., 1986
Frinton Laboratories Inc.,
Catalog Number 11, Frinton Laboratories Inc., Vineland, NJ, 1986, 99. [all data]
Al-Najjar and Al-Sammerrai, 2007
Al-Najjar, Hazim; Al-Sammerrai, Dhoaib,
Thermogravimetric determination of the heat of vaporization of some highly polar solvents,
J. Chem. Technol. Biotechnol., 2007, 37, 3, 145-152, https://doi.org/10.1002/jctb.280370302
. [all data]
Park and Gmehling, 1989
Park, So Jin; Gmehling, Juergen,
Isobaric vapor-liquid equilibrium data for the binary systems 1,3,5-trimethylbenzene/N-formylmorpholine and m-xylene/N-formylmorpholine,
J. Chem. Eng. Data, 1989, 34, 4, 399-401, https://doi.org/10.1021/je00058a008
. [all data]
Machiels, van Ruth, et al., 2003
Machiels, D.; van Ruth, S.M.; Posthumus, M.A.; Istasse, L.,
Gas chromatography-olfactometry analysis of the volatile compounds of two commercial Irish beef meats,
Talanta, 2003, 60, 4, 755-764, https://doi.org/10.1016/S0039-9140(03)00133-4
. [all data]