1-Dimethylaminohexane
- Formula: C8H19N
- Molecular weight: 129.2432
- IUPAC Standard InChIKey: QMHNQZGXPNCMCO-UHFFFAOYSA-N
- CAS Registry Number: 4385-04-0
- Chemical structure:
View 3d structure (requires JavaScript / HTML 5) - Other names: N,N-Dimethyl-n-hexylamine; N,N-Dimethylhexylamine; 1-Hexanamine, N,N-dimethyl-; Hexanamine, N,N-dimethyl

Phase change data

Data compiled as indicated in comments:
BS - Robert L. Brown and Stephen E. Stein
TRC - Thermodynamics Research Center, NIST Boulder Laboratories, Chris Muzny director
Quantity | Value | Units | Method | Reference | Comment |
---|---|---|---|---|---|
Tboil | 421.2 | K | N/A | Aldrich Chemical Company Inc., 1990 | BS |
Tboil | 418.15 | K | N/A | Barnhurst, 1961 | Uncertainty assigned by TRC = 3. K; TRC |
Tboil | 418.15 | K | N/A | Gautier, Renault, et al., 1957 | Uncertainty assigned by TRC = 3. K; TRC |
Tboil | 421.15 | K | N/A | Angyal, Penman, et al., 1953 | Uncertainty assigned by TRC = 4. K; TRC |
Tboil | 420.15 | K | N/A | Von Braun, 1911 | Uncertainty assigned by TRC = 3. K; TRC |

References

Aldrich Chemical Company Inc., 1990
Aldrich Chemical Company Inc.,
Catalog Handbook of Fine Chemicals, Aldrich Chemical Company, Inc., Milwaukee WI, 1990, 1. [all data]
Barnhurst, 1961
Barnhurst, J.D.,
Dipolar Ions Related To Taurine.,
J. Org. Chem., 1961, 26, 4520. [all data]
Gautier, Renault, et al., 1957
Gautier; Renault; Rabiant,
Bull. Soc. Chim. Fr., 1957, 1957, 1014. [all data]
Angyal, Penman, et al., 1953
Angyal, S.J.; Penman, D.R.; Warwick, G.P.,
The sommelet reaction: IV the preparation of aliphatic aldehydes,
J. Chem. Soc., 1953, 1953, 1737. [all data]
Von Braun, 1911
Von Braun, J.,
On the Decomposition of Quaternary Ammonium Hydroxide,
Justus Liebigs Ann. Chem., 1911, 382, 1. [all data]