6,6-Paracyclophane
- Formula: C24H32
- Molecular weight: 320.5109
- IUPAC Standard InChIKey: KZCIQXIXTWAXSA-UHFFFAOYSA-N
- CAS Registry Number: 4384-23-0
- Chemical structure:
View 3d structure (requires JavaScript / HTML 5) - Permanent link for this species. Use this link for bookmarking this species for future reference.

Gas phase thermochemistry data

Data compiled by: Hussein Y. Afeefy, Joel F. Liebman, and Stephen E. Stein
Quantity | Value | Units | Method | Reference | Comment |
---|---|---|---|---|---|
ΔfH°gas | -77. ± 12. | kJ/mol | Ccb | Shieh, McNally, et al., 1969 |

Condensed phase thermochemistry data

Data compiled by: Hussein Y. Afeefy, Joel F. Liebman, and Stephen E. Stein
Quantity | Value | Units | Method | Reference | Comment |
---|---|---|---|---|---|
ΔfH°solid | -192. ± 9.6 | kJ/mol | Ccb | Shieh, McNally, et al., 1969 | |
Quantity | Value | Units | Method | Reference | Comment |
ΔcH°solid | -13825. ± 9.6 | kJ/mol | Ccb | Shieh, McNally, et al., 1969 | Corresponding ΔfHºsolid = -193. kJ/mol (simple calculation by NIST; no Washburn corrections) |

Phase change data

Data compiled as indicated in comments:
ALS - Hussein Y. Afeefy, Joel F. Liebman, and Stephen E. Stein
DRB - Donald R. Burgess, Jr.
AC - William E. Acree, Jr., James S. Chickos
Quantity | Value | Units | Method | Reference | Comment |
---|---|---|---|---|---|
ΔsubH° | 115. ± 2. | kJ/mol | V | Shieh, McNally, et al., 1969 | ALS |
ΔsubH° | 115.0 | kJ/mol | N/A | Shieh, McNally, et al., 1969 | DRB |
ΔsubH° | 115.1 ± 2.1 | kJ/mol | N/A | Shieh, McNally, et al., 1969 | Based on data from 352. to 371. K. See also Pedley and Rylance, 1977.; AC |
Enthalpy of sublimation
ΔsubH (kJ/mol) | Temperature (K) | Reference | Comment |
---|---|---|---|
108.8 ± 0.8 | 352. to 371. | Shieh, McNally, et al., 1969 | See also Pedley and Rylance, 1977.; AC |

References

Shieh, McNally, et al., 1969
Shieh, C.; McNally, D.; Boyd, R.H.,
The heats of combustion and strain energies of some cyclophanes,
Tetrahedron, 1969, 3653-3665. [all data]
Pedley and Rylance, 1977
Pedley, J.B.; Rylance, J.,
, Computer Analysed Thermochemical Data: Organic and Organometallic Compounds, University of Sussex, Brighton, 1977. [all data]