2,6,10-Dodecatrienal, 3,7,11-trimethyl-, (Z,E)-
- Formula: C15H24O
- Molecular weight: 220.3505
- IUPAC Standard InChIKey: YHRUHBBTQZKMEX-PVMFERMNSA-N
- CAS Registry Number: 4380-32-9
- Chemical structure:
View 3d structure (requires JavaScript / HTML 5) - Stereoisomers:
- Other names: cis, trans-Farnesal; 2-cis-6-trans-Farnesal; (2Z,6E)-3,7,11-Trimethyl-2,6,10-dodecatrienal; Z,E-Farnesal; (2Z,6E)-Farnesal; (Z,E)-2,6-Farnesal; Farnesal (Isomer 2); cis-farnesal

Kovats' RI, non-polar column, temperature ramp

Column type | Active phase | I | Reference | Comment |
---|---|---|---|---|
Capillary | Methyl Silicone | 1664.9 | Rao, Rajanikanth, et al., 1989 | 4. K/min, 250. C @ 15. min; Column length: 12. m; Column diameter: 0.5 mm; Tstart: 70. C |

Van Den Dool and Kratz RI, non-polar column, temperature ramp

Column type | Active phase | I | Reference | Comment |
---|---|---|---|---|
Capillary | BP-1 | 1688. | Gonny, Cavaleiro, et al., 2006 | 50. m/0.22 mm/0.25 μm, He, 2. K/min, 220. C @ 20. min; Tstart: 60. C |

Van Den Dool and Kratz RI, polar column, temperature ramp

Column type | Active phase | I | Reference | Comment |
---|---|---|---|---|
Capillary | BP-20 | 2219. | Gonny, Cavaleiro, et al., 2006 | 50. m/0.22 mm/0.25 μm, He, 2. K/min, 220. C @ 20. min; Tstart: 60. C |

Normal alkane RI, non-polar column, temperature ramp

Column type | Active phase | I | Reference | Comment |
---|---|---|---|---|
Capillary | HP-5 | 1727. | Radulovic, Dordevic, et al., 2010 | 30. m/0.25 mm/0.25 μm, Hydrogen, 5. K/min; Tstart: 70. C; Tend: 290. C |

References

Rao, Rajanikanth, et al., 1989
Rao, A.S.; Rajanikanth, B.; Seshadri, R.,
Volatile aroma components of Curcuma amada Roxb.,
J. Agric. Food Chem., 1989, 37, 3, 740-743, https://doi.org/10.1021/jf00087a036
. [all data]
Gonny, Cavaleiro, et al., 2006
Gonny, M.; Cavaleiro, C.; Salgueiro, L.; Casanova, J.,
Analysis of Juniperus communis subsp. alpina needle, berry, wood and root oils by combination of GC, GC/MS and 13C-NMR,
Flavour Fragr. J., 2006, 21, 1, 99-106, https://doi.org/10.1002/ffj.1527
. [all data]
Radulovic, Dordevic, et al., 2010
Radulovic, N.S.; Dordevic, N.D.; Palic, R.M.,
Volatiles of Pleurospermum austriacum (L.) Hoffm. (Apiaceae),
J. Serbian Chem. Soc., 2010, 75, 12, 1-11, https://doi.org/10.2298/JSC100323127R
. [all data]