Cyclopropane, 1,1-dimethyl-2-methylene-

Reaction thermochemistry data

Data compiled by: Hussein Y. Afeefy, Joel F. Liebman, and Stephen E. Stein

Individual Reactions

Cyclopropane, 1,1-dimethyl-2-methylene- = Cyclopropane, (1-methylethylidene)-

By formula: C6H10 = C6H10

Quantity Value Units Method Reference Comment
Δr-4.9 ± 0.3kJ/molEqkCrawford and Tokunaga, 1974gas phase

References

Crawford and Tokunaga, 1974
Crawford, R.J.; Tokunaga, H., Thermolysis of 3,3,5,5-tetramethyl-4-methylene-1-pyrazoline and the thermal isomerization of some alkylidenecyclopropanes, Can. J. Chem., 1974, 52, 4033-4039. [all data]