p-Cymen-9-ol
- Formula: C10H14O
- Molecular weight: 150.2176
- IUPAC Standard InChIKey: CLFDIFDNDWRHJF-UHFFFAOYSA-N
- CAS Registry Number: 4371-50-0
- Chemical structure:
View 3d structure (requires JavaScript / HTML 5) - Other names: Cymene-9-ol

Kovats' RI, non-polar column, temperature ramp

Column type | Active phase | I | Reference | Comment |
---|---|---|---|---|
Capillary | CP Sil 8 CB | 1202. | Tayoub, Schwob, et al., 2006 | 30. m/0.25 mm/0.25 μm, H2, 50. C @ 2. min, 3. K/min; Tend: 220. C |
Capillary | CP Sil 8 CB | 1202. | Tayoub, Schwob, et al., 2006, 2 | 30. m/0.25 mm/0.25 μm, H2, 50. C @ 2. min, 3. K/min; Tend: 220. C |

Van Den Dool and Kratz RI, non-polar column, temperature ramp

Column type | Active phase | I | Reference | Comment |
---|---|---|---|---|
Capillary | DB-5 | 1205. | Su, Ho, et al., 2006 | 30. m/0.25 mm/0.25 μm, He, 50. C @ 2. min, 5. K/min; Tend: 250. C |
Capillary | SE-54 | 1203. | Alma, Nitz, et al., 2004 | 30. m/0.25 mm/0.25 μm, He, 60. C @ 5. min, 2. K/min; Tend: 260. C |
Capillary | DB-5 | 1178. | Guichard and Souty, 1988 | H2, 30. C @ 5. min, 1.5 K/min; Column length: 0.32 m; Column diameter: 1. mm; Tend: 180. C |

Normal alkane RI, non-polar column, temperature ramp

Column type | Active phase | I | Reference | Comment |
---|---|---|---|---|
Capillary | DB-5 | 1202. | Pontes, de Olivera, et al., 2007 | 30. m/0.25 mm/0.25 μm, Hydrogen, 4. K/min; Tstart: 50. C; Tend: 250. C |
Capillary | CP Sil 5 CB | 1157. | Ayoub, Al-Azizi, et al., 2006 | He, 10. K/min; Column length: 25. m; Tstart: 80. C; Tend: 270. C |
Capillary | DB-5 | 1207. | Morteza-Semnani and Saeedi, 2005 | 30. m/0.25 mm/0.25 μm, He, 60. C @ 4. min, 4. K/min; Tend: 220. C |
Capillary | DB-1 | 1191. | Palá-Paúl, Velasco-Negueruela, et al., 2004 | 50. m/0.25 mm/0.25 μm, N2, 4. K/min; Tstart: 95. C; Tend: 240. C |
Capillary | DB-5 | 1206. | Maia, Zoghbi, et al., 2000 | 30. m/0.25 mm/0.25 μm, He, 3. K/min; Tstart: 60. C; Tend: 240. C |

Normal alkane RI, non-polar column, custom temperature program

Column type | Active phase | I | Reference | Comment |
---|---|---|---|---|
Capillary | Siloxane, 5 % Ph | 1195. | VOC BinBase, 2012 | Program: not specified |
Capillary | Polydimethyl siloxane, 5 % phenyl | 1195. | Skogerson, Wohlgemuth, et al., 2011 | Program: not specified |
Capillary | DB-5 | 1206. | Pontes, de Olivera, et al., 2007 | 30. m/0.25 mm/0.25 μm, Hydrogen; Program: not specified |
Capillary | SE-30 | 1196. | Vinogradov, 2004 | Program: not specified |
Capillary | CP Sil 5 CB | 1178. | Weyerstahl, Marschall, et al., 1997 | N2; Column length: 30. m; Column diameter: 0.25 mm; Program: not specified |
Capillary | Polydimethyl siloxanes | 1196. | Zenkevich, 1997 | Program: not specified |

Normal alkane RI, polar column, temperature ramp

Column type | Active phase | I | Reference | Comment |
---|---|---|---|---|
Capillary | Carbowax 20M | 1962. | Krings, Brauer, et al., 2005 | 25. m/0.53 mm/2.0 μm, H2, 40. C @ 3. min, 5. K/min, 210. C @ 10. min |

Normal alkane RI, polar column, custom temperature program

Column type | Active phase | I | Reference | Comment |
---|---|---|---|---|
Capillary | Innowax FSC | 1912. | Baser, Demirci, et al., 2009 | 60. m/0.25 mm/0.25 μm, Helium; Program: 60 0C (10 min) 4 0C/min -> 220 0C (10 min) 1 0C/min -> 240 0C |
Capillary | Carbowax 20M | 1880. | Vinogradov, 2004 | Program: not specified |

References

Tayoub, Schwob, et al., 2006
Tayoub, G.; Schwob, I.; Bessiere, J.-M.; Masotti, V.; Rabier, J.; Ruzzier, M.; Viano, J.,
Composition of volatile oils of Styrax (Styrax officinalis L.) leaves at different phenological stages,
Biochem. Syst. Ecol., 2006, 34, 9, 705-709, https://doi.org/10.1016/j.bse.2006.05.008
. [all data]
Tayoub, Schwob, et al., 2006, 2
Tayoub, G.; Schwob, I.; Bessière, J.-M.; Rabier, J.; Masotti, V.; J.; M.; Girard, G.; Viano, J.,
Essential oil composition of leaf, flower and stem of Styrax (Styrax officinalis L.) from south-eastern France,
Flavour Fragr. J., 2006, 21, 5, 809-812, https://doi.org/10.1002/ffj.1731
. [all data]
Su, Ho, et al., 2006
Su, Y.-C.; Ho, C.-L.; Wang, E.I.-C.; Chang, S.-T.,
Antifungal activities and chemical compositions of essential oils from leaves of four eucalypts,
Taiwan J. For. Sci., 2006, 21, 1, 49-61. [all data]
Alma, Nitz, et al., 2004
Alma, M.H.; Nitz, S.; Kollmannsberger, H.; Digrak, M.; Efe, F.T.; Yilmaz, N.,
Chemical composition and antimicrobial activity of the essential oils from the gum of Turkish Pistachio (Pistacia vera L.),
J. Agric. Food Chem., 2004, 52, 12, 3911-3914, https://doi.org/10.1021/jf040014e
. [all data]
Guichard and Souty, 1988
Guichard, E.; Souty, M.,
Comparison of the relative quantities of aroma compounds found in fresh apricot (Prunus armeniaca) from six different varieties,
Z. Lebensm. Unters. Forsch., 1988, 186, 4, 301-307, https://doi.org/10.1007/BF01027031
. [all data]
Pontes, de Olivera, et al., 2007
Pontes, W.J.T.; de Olivera, J.C.G.; da Camara, C.A.G.; Lopes, A.C.H.R.; Gondim Jr.; de Olivera, J.V.; Barros, R.; Schwartz, M.O.E.,
Chemical composition and acaridical activity of the leaf and fruit essential oils of Protium heptaphyllum (Aubl.) Marchand (Burseraceae),
Acta Amazonica, 2007, 37, 1, 103-110, https://doi.org/10.1590/S0044-59672007000100012
. [all data]
Ayoub, Al-Azizi, et al., 2006
Ayoub, N.; Al-Azizi, M.; König, W.; Kubeczka, K.-H.,
Essential oils and a novel polyacetylene from Eryngium yuccifolium Michaux. (Apiaceae),
Flavour Fragr. J., 2006, 21, 6, 864-868, https://doi.org/10.1002/ffj.1631
. [all data]
Morteza-Semnani and Saeedi, 2005
Morteza-Semnani, K.; Saeedi, M.,
The essential oil composition of Phlomis bruguieri Desf. from Iran,
Flavour Fragr. J., 2005, 20, 3, 344-346, https://doi.org/10.1002/ffj.1459
. [all data]
Palá-Paúl, Velasco-Negueruela, et al., 2004
Palá-Paúl, J.; Velasco-Negueruela, A.; Pérez-Alonso, M.J.; Maqueda, J.; Sanz, J.,
Volatile oil constituents from different parts of Cachrys trifida L.,
J. Essent. Oil Res., 2004, 16, 4, 347-349, https://doi.org/10.1080/10412905.2004.9698738
. [all data]
Maia, Zoghbi, et al., 2000
Maia, J.G.S.; Zoghbi, M.G.B.; Andrade, E.H.A.; da Silva, M.H.L.,
Essential oils from Conobea scoparioides (Cham. Schltdl.) Benth.,
Flavour Fragr. J., 2000, 15, 6, 413-414, https://doi.org/10.1002/1099-1026(200011/12)15:6<413::AID-FFJ931>3.0.CO;2-H
. [all data]
VOC BinBase, 2012
VOC BinBase,
The volatile compound BinBase (VOC BinBase), 2012, retrieved from http://fiehnlab.ucdavis.edu/projects/VocBinBase and http://binbase.sourceforge.net. [all data]
Skogerson, Wohlgemuth, et al., 2011
Skogerson, K.; Wohlgemuth, G.; Fiehn, O.,
VocBinNase, 2011, retrieved from http://fiehnlab.ucdavis.edu/projects//VocBinBase. [all data]
Vinogradov, 2004
Vinogradov, B.A.,
Production, composition, properties and application of essential oils, 2004, retrieved from http://viness.narod.ru. [all data]
Weyerstahl, Marschall, et al., 1997
Weyerstahl, P.; Marschall, H.; Seelmann, I.; Rustaiyan, A.,
Constituents of the essential oil of Achillea eriophora DC,
Flavour Fragr. J., 1997, 12, 2, 71-78, https://doi.org/10.1002/(SICI)1099-1026(199703)12:2<71::AID-FFJ620>3.0.CO;2-E
. [all data]
Zenkevich, 1997
Zenkevich, I.G.,
Analytical Parameters of Components of Essential Oils for their Chromatographic and Chromato-Spectral Identificaiton. Oxsigenated derivatives of Mono- and Sesquiterpene Hydrocarbons,
Rastit, Resursy (Rus.), 1997, 33, 1, 16-28. [all data]
Krings, Brauer, et al., 2005
Krings, U.; Brauer, B.; Kaspera, R.; Berger, R.G.,
Biotransformation of gamma-terpinene using Stemphylium botryosum (Wallroth) yields p-mentha-1,4-dien-9-ol, a novel odorous monoterpenol,
Biocatal. Biotransform., 2005, 23, 6, 457-463, https://doi.org/10.1080/10242420500444267
. [all data]
Baser, Demirci, et al., 2009
Baser, K.H.C.; Demirci, B.; Kurkcuoglu, M.; Satin, F.; Tumen, G.,
Comparative morphological and phytochemical charactertization of Salvia cadmica and S. smyrnaea,
Pak. J. Bot., 2009, 41, 4, 1545-1555. [all data]