Cyclohexanepropanol, α,2,2,6-tetramethyl-
- Formula: C13H26O
- Molecular weight: 198.3449
- IUPAC Standard InChIKey: UZWOWEPOVKVMEL-UHFFFAOYSA-N
- CAS Registry Number: 4361-23-3
- Chemical structure:
View 3d structure (requires JavaScript / HTML 5) - Other names: Tetrahydroionol; 4-(2,2,6-Trimethylcyclohexyl)-2-butanol; α,2,2,6-tetramethylcyclohexanepropanol

Kovats' RI, non-polar column, isothermal

Column type | Active phase | Temperature (C) | I | Reference | Comment |
---|---|---|---|---|---|
Capillary | SE-30 | 100. | 1424.0 | Tudor, 1997 | 40. m/0.35 mm/0.35 μm |
Capillary | SE-30 | 100. | 1432.8 | Tudor, 1997 | 40. m/0.35 mm/0.35 μm |

References

Tudor, 1997
Tudor, E.,
Temperature dependence of the retention index for perfumery compounds on a SE-30 glass capillary column. I. Linear equations,
J. Chromatogr. A, 1997, 779, 1-2, 287-297, https://doi.org/10.1016/S0021-9673(97)00453-6
. [all data]