α-isomalic acid
- Formula: C4H6O5
- Molecular weight: 134.0874
- IUPAC Standard InChIKey: GCHPUFAZSONQIV-YFKPBYRVSA-N
- CAS Registry Number: 4360-96-7
- Chemical structure:
View 3d structure (requires JavaScript / HTML 5) - Stereoisomers:

Phase change data

Data compiled by: Thermodynamics Research Center, NIST Boulder Laboratories, Chris Muzny director
Quantity | Value | Units | Method | Reference | Comment |
---|---|---|---|---|---|
Tfus | 401.9 | K | N/A | Weiss and Downs, 1923 | Uncertainty assigned by TRC = 1.5 K; identified as i-malic acid. Some conversion to malo-malic acid on melting. Succesive fusions occur at lower temp. |

References

Weiss and Downs, 1923
Weiss, J.M.; Downs, C.R.,
The Physical Properties of Maleic, Fumaric and Malic Acids,
J. Am. Chem. Soc., 1923, 45, 1003. [all data]