Methyl mandelate
- Formula: C9H10O3
- Molecular weight: 166.1739
- IUPAC Standard InChIKey: ITATYELQCJRCCK-UHFFFAOYSA-N
- CAS Registry Number: 4358-87-6
- Chemical structure:
View 3d structure (requires JavaScript / HTML 5) - Other names: Methyl dl-mandelate; Benzeneacetic acid, α-hydroxy-, methyl ester, (.+/-.)-; Benzeneacetic acid, α-hydroxy-, methyl ester, (±)-; Methyl hydroxy(phenyl)acetate; DL-Mandelic acid, methyl ester; NSC 6539; Methyl 2-hydroxy-2-phenylethanoate; methyl (±)-glycolate

Phase change data

Data compiled by: Robert L. Brown and Stephen E. Stein
Reduced pressure boiling point
Tboil (K) | Pressure (bar) | Reference |
---|---|---|
408.2 | 0.016 | Aldrich Chemical Company Inc., 1990 |

Van Den Dool and Kratz RI, non-polar column, custom temperature program

Column type | Active phase | I | Reference | Comment |
---|---|---|---|---|
Capillary | VF-5MS | 1309.2 | Tret'yakov, 2008 | 30. m/0.25 mm/0.25 μm, He; Program: Multi-step temperature program; T(initial)=60C; T(final)=270C |

Normal alkane RI, non-polar column, custom temperature program

Column type | Active phase | I | Reference | Comment |
---|---|---|---|---|
Capillary | HP-1 | 1244. | Rowland, Blackman, et al., 1995 | 25. m/0.25 mm/0.25 μm; Program: 30 0C (4 min) 6 K/min -> 200 0C 15 K/min -> 250 0C (20 min) |

References

Aldrich Chemical Company Inc., 1990
Aldrich Chemical Company Inc.,
Catalog Handbook of Fine Chemicals, Aldrich Chemical Company, Inc., Milwaukee WI, 1990, 1. [all data]
Tret'yakov, 2008
Tret'yakov, K.V.,
Retention Data. NIST Mass Spectrometry Data Center., NIST Mass Spectrometry Data Center, 2008. [all data]
Rowland, Blackman, et al., 1995
Rowland, C.Y.; Blackman, A.J.; D'Arcy, B.R.; Rintoul, G.B.,
Comparison of organic extractives found in leatherwood (Eucryphia lucida) honey and leatherwood flowers and leaves,
J. Agric. Food Chem., 1995, 43, 3, 753-763, https://doi.org/10.1021/jf00051a036
. [all data]