1,3-Dioxolane, 4-methyl-2-propyl-

Kovats' RI, non-polar column, isothermal

View large format table.

Column type Active phase Temperature (C) I Reference Comment
CapillaryOV-101110.876.Misharina, Golovnya, et al., 199250. m/0.32 mm/0.5 μm, He
CapillaryOV-101130.879.Misharina, Golovnya, et al., 199250. m/0.32 mm/0.5 μm, He
CapillaryOV-101110.867.Misharina, Golovnya, et al., 199250. m/0.32 mm/0.5 μm, He
CapillaryOV-101130.870.Misharina, Golovnya, et al., 199250. m/0.32 mm/0.5 μm, He

Van Den Dool and Kratz RI, non-polar column, temperature ramp

View large format table.

Column type Active phase I Reference Comment
CapillaryOV-101874.Misharina, Golovnya, et al., 199250. m/0.32 mm/0.5 μm, He, 4. K/min; Tstart: 50. C; Tend: 200. C
CapillaryOV-101864.Misharina, Golovnya, et al., 199250. m/0.32 mm/0.5 μm, He, 4. K/min; Tstart: 50. C; Tend: 200. C

Van Den Dool and Kratz RI, non-polar column, custom temperature program

View large format table.

Column type Active phase I Reference Comment
CapillaryHP-5MS840.1Andriamaharavo, 201430. m/0.25 mm/0.25 μm, He; Program: 60C (1 min) => 5 C/min => 210C => 10 C/min => 280C (15 min)

References

Misharina, Golovnya, et al., 1992
Misharina, T.A.; Golovnya, R.V.; Yakovleva, V.N., GC-MS and GC-FTIR characteristics of 2-alkyl- and 4-methyl-2-alkyl-1,3-dioxolans, Zh. Anal. Khim., 1992, 47, 304-311. [all data]

Andriamaharavo, 2014
Andriamaharavo, N.R., Retention Data. NIST Mass Spectrometry Data Center., NIST Mass Spectrometry Data Center, 2014. [all data]