1,3-Dioxolane, 2-methyl-2-pentyl-
- Formula: C9H18O2
- Molecular weight: 158.2380
- IUPAC Standard InChIKey: OUQPLRDJDIOBOU-UHFFFAOYSA-N
- CAS Registry Number: 4352-95-8
- Chemical structure:
View 3d structure (requires JavaScript / HTML 5) - Other names: 2-Heptanone, cyclic 1,2-ethanediyl acetal; 2-Methyl-2-pentyl-1,3-dioxolane

Phase change data

Data compiled by: William E. Acree, Jr., James S. Chickos
Quantity | Value | Units | Method | Reference | Comment |
---|---|---|---|---|---|
ΔvapH° | 54.0 ± 0.3 | kJ/mol | GS | Verevkin, Peng, et al., 1998 | Based on data from 278. to 318. K. See also Verevkin, 2002. |

References

Verevkin, Peng, et al., 1998
Verevkin, S.P.; Peng, W.-H.; Beckhaus, H.D.; Rücuardt, C.,
Geminal substituent effects. 16. Does the anomeric effect in ketals depend on the hybridization of the central carbon atom?,
Eur. J. Org. Chem., 1998, 11, 2323. [all data]
Verevkin, 2002
Verevkin, Sergey P.,
Improved Benson Increments for the Estimation of Standard Enthalpies of Formation and Enthalpies of Vaporization of Alkyl Ethers, Acetals, Ketals, and Ortho Esters,
J. Chem. Eng. Data, 2002, 47, 5, 1071-1097, https://doi.org/10.1021/je020023o
. [all data]