Butanoic acid, phenyl ester
- Formula: C10H12O2
- Molecular weight: 164.2011
- IUPAC Standard InChIKey: IGVPBCZDHMIOJH-UHFFFAOYSA-N
- CAS Registry Number: 4346-18-3
- Chemical structure:

Phase change data

Data compiled by: Thermodynamics Research Center, NIST Boulder Laboratories, Chris Muzny director
Quantity | Value | Units | Method | Reference | Comment |
---|---|---|---|---|---|
Tboil | 500.65 | K | N/A | Perkin, 1896 | Uncertainty assigned by TRC = 1. K |

Kovats' RI, non-polar column, isothermal

Column type | Active phase | Temperature (C) | I | Reference | Comment |
---|---|---|---|---|---|
Packed | SE-30 | 200. | 1245. | Haken, Hartley, et al., 1983 | Chromosorb W AW DMCS; Column length: 3.7 m |

References

Perkin, 1896
Perkin, W.H.,
LXIX. On Magnetic Rotatory Power, especially of Aromatic Compounds,
J. Chem. Soc., 1896, 69, 1025-1257. [all data]
Haken, Hartley, et al., 1983
Haken, J.K.; Hartley, H.N.T.; Srisukh, D.,
Retention increments of aromatic esters,
Chromatographia, 1983, 17, 11, 589-596, https://doi.org/10.1007/BF02261941
. [all data]