Benzenamine, 4-butoxy-
- Formula: C10H15NO
- Molecular weight: 165.2322
- IUPAC Standard InChIKey: UBRIHZOFEJHMIT-UHFFFAOYSA-N
- CAS Registry Number: 4344-55-2
- Chemical structure:
View 3d structure (requires JavaScript / HTML 5) - Other names: 4-Butoxyaniline; p-Butoxyaniline; p-Butyloxyaniline; Aniline, p-butoxy-; p-Aminophenol n-butyl ether; p-Aminophenyl-n-butyl ether

Phase change data

Data compiled by: Robert L. Brown and Stephen E. Stein
Reduced pressure boiling point
Tboil (K) | Pressure (bar) | Reference |
---|---|---|
421.7 | 0.017 | Aldrich Chemical Company Inc., 1990 |
357. to 359. | 0.00007 | Frinton Laboratories Inc., 1986 |

References

Aldrich Chemical Company Inc., 1990
Aldrich Chemical Company Inc.,
Catalog Handbook of Fine Chemicals, Aldrich Chemical Company, Inc., Milwaukee WI, 1990, 1. [all data]
Frinton Laboratories Inc., 1986
Frinton Laboratories Inc.,
Catalog Number 11, Frinton Laboratories Inc., Vineland, NJ, 1986, 99. [all data]