Lithocholic acid
- Formula: C24H40O3
- Molecular weight: 376.5726
- IUPAC Standard InChIKey: SMEROWZSTRWXGI-VKPXTEDRSA-N
- CAS Registry Number: 434-13-9
- Chemical structure:
View 3d structure (requires JavaScript / HTML 5) - Other names: Cholan-24-oic acid, 3-hydroxy-, (3α,5β)-; 5β-Cholan-24-oic acid, 3α-hydroxy-; Lithocolic acid; 3α-Hydroxy-5β-cholanic acid; 3α-Hydroxy-5β-cholanoic acid; 3α-Hydroxycholanic acid; 3-Hydroxycholan-24-oic acid; 5β-Cholanic acid-3α-ol; 5-β-Cholanic acid, 3-α-hydroxy-; 17-β-(1-Methyl-3-carboxypropyl)ethiocholan-3-α-ol; NCI-C03861; 3α-Hydroxy-5β-cholan-24-oic acid; NSC 683770

Phase change data

Data compiled by: Thermodynamics Research Center, NIST Boulder Laboratories, Chris Muzny director
Quantity | Value | Units | Method | Reference | Comment |
---|---|---|---|---|---|
Tfus | 462. | K | N/A | Huang-Minlon, 1949 | Uncertainty assigned by TRC = 4. K |

References

Huang-Minlon, 1949
Huang-Minlon,
Reduction of Steroid Ketones and Other Carbonyl Compounds by Modified Wolff-Kishner Method,
J. Am. Chem. Soc., 1949, 71, 3301. [all data]