Maleimide, N-(p-nitrophenyl)-
- Formula: C10H6N2O4
- Molecular weight: 218.1656
- IUPAC Standard InChIKey: CVKDEEISKBRPEQ-UHFFFAOYSA-N
- CAS Registry Number: 4338-06-1
- Chemical structure:
View 3d structure (requires JavaScript / HTML 5) - Other names: N-(4-Nitrophenyl)maleimide

Phase change data

Data compiled by: William E. Acree, Jr., James S. Chickos
Enthalpy of sublimation
ΔsubH (kJ/mol) | Temperature (K) | Method | Reference |
---|---|---|---|
117.3 ± 1.2 | 350. to 370. | C | Kiselev, Kashaeva, et al., 1998 |

Reaction thermochemistry data

Data compiled by: Hussein Y. Afeefy, Joel F. Liebman, and Stephen E. Stein
Individual Reactions
+
= C30H20N2O5
By formula: C10H6N2O4 + C20H14O = C30H20N2O5
Quantity | Value | Units | Method | Reference | Comment |
---|---|---|---|---|---|
ΔrH° | -96.4 | kJ/mol | Cm | Kiselev, Mavrin, et al., 1980 | solid phase |
ΔrH° | -96.36 ± 0.59 | kJ/mol | Cm | Kiselev, Ustyugov, et al., 1977 | liquid phase; solvent: Dioxane |

References

Kiselev, Kashaeva, et al., 1998
Kiselev, V.D.; Kashaeva, E.A.; Konovalov, A.I.,
Enthalpies of sublimation, solution, and solvation of N-arylmaleimides,
Russ. J. Gen. Chem., 1998, 68, 8, 1246. [all data]
Kiselev, Mavrin, et al., 1980
Kiselev, V.D.; Mavrin, G.V.; Konovalov, A.I.,
Kinetic and thermochemical study of the Diels-Alder reaction of 1,3-diphenylisobenzofuran with p-benzoquinone and 1,4-naphthoquinone, Deposited Document, SPSTL 10 Khp-D80. Chem Abst. 96:141976a, 1980, 1-6. [all data]
Kiselev, Ustyugov, et al., 1977
Kiselev, V.D.; Ustyugov, A.N.; Breus, I.P.; Konovalov, A.I.,
Kinetic and thermochemical study of the Diels-Alder reaction,
Dokl. Phys. Chem. (Engl. Transl.), 1977, 234, 320-322, In original 1089. [all data]