Acetic acid, difluoro-, methyl ester
- Formula: C3H4F2O2
- Molecular weight: 110.0595
- IUPAC Standard InChIKey: CSSYKHYGURSRAZ-UHFFFAOYSA-N
- CAS Registry Number: 433-53-4
- Chemical structure:
View 3d structure (requires JavaScript / HTML 5) - Other names: methyl difluoroacetate

Phase change data

Data compiled as indicated in comments:
BS - Robert L. Brown and Stephen E. Stein
AC - William E. Acree, Jr., James S. Chickos
Quantity | Value | Units | Method | Reference | Comment |
---|---|---|---|---|---|
Tboil | 358. to 359. | K | N/A | PCR Inc., 1990 | BS |
Enthalpy of vaporization
ΔvapH (kJ/mol) | Temperature (K) | Method | Reference | Comment |
---|---|---|---|---|
41.9 | 288. | GS | Stephenson and Malanowski, 1987 | Based on data from 273. to 333. K. See also Redemann, Chaikin, et al., 1948 and Dykyj, 1970.; AC |

References

PCR Inc., 1990
PCR Inc.,
Research Chemicals Catalog 1990-1991, PCR Inc., Gainesville, FL, 1990, 1. [all data]
Stephenson and Malanowski, 1987
Stephenson, Richard M.; Malanowski, Stanislaw,
Handbook of the Thermodynamics of Organic Compounds, 1987, https://doi.org/10.1007/978-94-009-3173-2
. [all data]
Redemann, Chaikin, et al., 1948
Redemann, C. Ernst; Chaikin, Saul W.; Fearing, Ralph B.; Rotariu, George J.; Savit, Joseph; Hoesen, Drusilla van,
The Vapor Pressures of Forty-one Fluorine-containing Organic Compounds 1,
J. Am. Chem. Soc., 1948, 70, 11, 3604-3606, https://doi.org/10.1021/ja01191a017
. [all data]
Dykyj, 1970
Dykyj, J.,
Petrochemica, 1970, 10, 2, 51. [all data]