Glycine, N-[N-(trifluoroacetyl)glycyl]-, methyl ester
- Formula: C7H9F3N2O4
- Molecular weight: 242.1526
- IUPAC Standard InChIKey: VQFVYTURUFTZIM-UHFFFAOYSA-N
- CAS Registry Number: 433-33-0
- Chemical structure:
View 3d structure (requires JavaScript / HTML 5) - Other names: Trifluoroacetylglycylglycine methyl ester; N-[N-(Trifluoroacetyl)glycyl]glycine methyl ester

Phase change data

Data compiled by: William E. Acree, Jr., James S. Chickos
Enthalpy of vaporization
ΔvapH (kJ/mol) | Temperature (K) | Method | Reference | Comment |
---|---|---|---|---|
93.8 | 431. | A | Stephenson and Malanowski, 1987 | Based on data from 420. to 443. K. See also Kkykj and Repas, 1973. |
Enthalpy of sublimation
ΔsubH (kJ/mol) | Temperature (K) | Reference | Comment |
---|---|---|---|
127.9 | 338. | Stephenson and Malanowski, 1987 | Based on data from 323. to 419. K. See also Weygand, Klipping, et al., 1960. |

References

Stephenson and Malanowski, 1987
Stephenson, Richard M.; Malanowski, Stanislaw,
Handbook of the Thermodynamics of Organic Compounds, 1987, https://doi.org/10.1007/978-94-009-3173-2
. [all data]
Kkykj and Repas, 1973
Kkykj, J.; Repas, M.,
Petrochemia, 1973, 13, 179. [all data]
Weygand, Klipping, et al., 1960
Weygand, Friedrich; Klipping, Gustav; Palm, Dieter,
N-Trifluoracetyl-aminosäuren, XVIII. Dampfdruckmessungen anN-TFA-Aminosäuren, -Peptiden und ihren Estern,
Chem. Ber., 1960, 93, 11, 2619-2625, https://doi.org/10.1002/cber.19600931129
. [all data]