Pentane, 2-chloro-2-methyl-
- Formula: C6H13Cl
- Molecular weight: 120.620
- IUPAC Standard InChIKey: NXXHAWKBICGUCK-UHFFFAOYSA-N
- CAS Registry Number: 4325-48-8
- Chemical structure:
View 3d structure (requires JavaScript / HTML 5) - Other names: 2-Chloro-2-methylpentane

Condensed phase thermochemistry data

Data compiled by: Hussein Y. Afeefy, Joel F. Liebman, and Stephen E. Stein
Quantity | Value | Units | Method | Reference | Comment |
---|---|---|---|---|---|
ΔfH°liquid | -264. ± 2. | kJ/mol | Cm | Arnett and Pienta, 1980 | Hydrochlorination |

Phase change data

Data compiled by: Thermodynamics Research Center, NIST Boulder Laboratories, Chris Muzny director
Quantity | Value | Units | Method | Reference | Comment |
---|---|---|---|---|---|
Tboil | 384.15 | K | N/A | Petrov, Chel'tsova, et al., 1952 | Uncertainty assigned by TRC = 3. K |
Tboil | 384.65 | K | N/A | Stevenson, Wagner, et al., 1952 | Uncertainty assigned by TRC = 2. K |

Reaction thermochemistry data

Data compiled by: Hussein Y. Afeefy, Joel F. Liebman, and Stephen E. Stein
Individual Reactions
By formula: C6H12 + HCl = C6H13Cl
Quantity | Value | Units | Method | Reference | Comment |
---|---|---|---|---|---|
ΔrH° | -58.99 ± 0.75 | kJ/mol | Cm | Arnett and Pienta, 1980 | liquid phase; solvent: Methylene chloride; Hydrochlorination |
By formula: C6H12 + HCl = C6H13Cl
Quantity | Value | Units | Method | Reference | Comment |
---|---|---|---|---|---|
ΔrH° | -64.7 ± 1.4 | kJ/mol | Cm | Arnett and Pienta, 1980 | liquid phase; solvent: Methylene chloride; Hydrochlorination |
By formula: C6H13Cl = C6H13Cl
Quantity | Value | Units | Method | Reference | Comment |
---|---|---|---|---|---|
ΔrH° | 8. ± 1. | kJ/mol | Eqk | Andreevskii, Kabo, et al., 1974 | liquid phase; Isomerization |
By formula: C6H13Cl = C6H13Cl
Quantity | Value | Units | Method | Reference | Comment |
---|---|---|---|---|---|
ΔrH° | 2.8 ± 0.3 | kJ/mol | Eqk | Andreevskii, Kabo, et al., 1974 | liquid phase; Isomerization |

Kovats' RI, non-polar column, isothermal

Column type | Active phase | Temperature (C) | I | Reference | Comment |
---|---|---|---|---|---|
Packed | Apiezon L | 100. | 807. | Castello and D'Amato, 1986 | |
Packed | Apiezon L | 75. | 811. | Castello and D'Amato, 1986 | |
Capillary | Apiezon L | 90. | 763. | Morishita, Terashima, et al., 1983 | He; Column length: 45. m; Column diameter: 0.25 mm |

Kovats' RI, polar column, isothermal

Column type | Active phase | Temperature (C) | I | Reference | Comment |
---|---|---|---|---|---|
Packed | Carbowax 20M | 100. | 898. | Castello and D'Amato, 1986 | He, Chromosorb W AW DMC; Column length: 3. m |
Packed | Carbowax 20M | 125. | 916. | Castello and D'Amato, 1986 | He, Chromosorb W AW DMC; Column length: 3. m |
Packed | Carbowax 20M | 75. | 899. | Castello and D'Amato, 1986 | He, Chromosorb W AW DMC; Column length: 3. m |

Van Den Dool and Kratz RI, non-polar column, temperature ramp

Column type | Active phase | I | Reference | Comment |
---|---|---|---|---|
Capillary | Petrocol DH | 766.54 | White, Douglas, et al., 1992 | 100. m/0.25 mm/0.5 μm, He, 1. K/min; Tstart: 30. C; Tend: 220. C |
Capillary | Petrocol DH | 767. | White, Hackett, et al., 1992 | 100. m/0.25 mm/0.5 μm, He, 1. K/min; Tstart: 30. C; Tend: 220. C |

Normal alkane RI, non-polar column, isothermal

Column type | Active phase | Temperature (C) | I | Reference | Comment |
---|---|---|---|---|---|
Capillary | Apiezon L | 130. | 763. | Arruda, Junkes, et al., 2008 |

References

Arnett and Pienta, 1980
Arnett, E.M.; Pienta, N.J.,
Stabilities of carbonium ions in solution. 12. Heats of formation of alkyl chlorides as an entree to heats of solvation of aliphatic carbonium ions,
J. Am. Chem. Soc., 1980, 102, 3329-3334. [all data]
Petrov, Chel'tsova, et al., 1952
Petrov, A.D.; Chel'tsova, M.A.; Chernyshev, E.A.,
Behaviour of γ-Alkenyl Halides in the Grignard-Wurtz Synthesis,
Izv. Akad. Nauk SSSR, 1952, 1952, 1087. [all data]
Stevenson, Wagner, et al., 1952
Stevenson, D.P.; Wagner, C.D.; Beeck, O.; Otvos, J.W.,
Hydrogen exchange and isomerization of saturated hydrocarbons with sulfuric acid.,
J. Am. Chem. Soc., 1952, 74, 3269. [all data]
Andreevskii, Kabo, et al., 1974
Andreevskii, D.N.; Kabo, G.Ya.; Esipenok, G.E.,
Equilibria and thermodynamics of the isomerisation of methylchloropentanes,
Russ. J. Phys. Chem. (Engl. Transl.), 1974, 48, 955. [all data]
Castello and D'Amato, 1986
Castello, G.; D'Amato, G.,
Gas chromatographic separation and identification of linear and branched-chain alkyl chlorides,
J. Chromatogr., 1986, 354, 65-74, https://doi.org/10.1016/S0021-9673(01)87011-4
. [all data]
Morishita, Terashima, et al., 1983
Morishita, F.; Terashima, Y.; Ichise, M.; Kojima, T.,
Prediction of retention indices from molecular structures of chlorinated alkanes,
J. Chromatogr. Sci., 1983, 21, 5, 209-213, https://doi.org/10.1093/chromsci/21.5.209
. [all data]
White, Douglas, et al., 1992
White, C.M.; Douglas, L.J.; Hackett, J.P.; Anderson, R.R.,
Characterization of synthetic gasoline from the chloromethane-zeolite reaction,
Energy Fuels, 1992, 6, 1, 76-82, https://doi.org/10.1021/ef00031a012
. [all data]
White, Hackett, et al., 1992
White, C.M.; Hackett, J.; Anderson, R.R.; Kail, S.; Spock, P.S.,
Linear temperature programmed retention indices of gasoline range hydrocarbons and chlorinated hydrocarbons on cross-linked polydimethylsiloxane,
J. Hi. Res. Chromatogr., 1992, 15, 2, 105-120, https://doi.org/10.1002/jhrc.1240150211
. [all data]
Arruda, Junkes, et al., 2008
Arruda, A.C.S.; Junkes, B. da.S.; Souza, E.S.; Yunes, R.A.; Heizen, V.E.F.,
Semi-Emlirical Topological Index to Predict Properties of Halogenated Aliphatic Compounds,
J. Chemometrics, 2008, 22, 3-4, 186-194, https://doi.org/10.1002/cem.1121
. [all data]