Finaven
- Formula: C18H20N2O4S
- Molecular weight: 360.427
- IUPAC Standard InChIKey: XQEMNBNCQVQXMO-UHFFFAOYSA-M
- CAS Registry Number: 43222-48-6
- Chemical structure:
View 3d structure (requires JavaScript / HTML 5) - Other names: 1H-Pyrazolium, 1,2-dimethyl-3,5-diphenyl-, methyl sulfate; Avenge; AC 84777; 1,2-Dimethyl-3,5-Diphenylpyrazolium methyl sulfate; Avenge 2; Difenzoquat methyl sulfate; 1,2-dimethyl-3,5-diphenylpyrazolium methylsulphate

Phase change data

Data compiled by: Thermodynamics Research Center, NIST Boulder Laboratories, Chris Muzny director
Quantity | Value | Units | Method | Reference | Comment |
---|---|---|---|---|---|
Tfus | 431.63 | K | N/A | Donnelly, Drewes, et al., 1990 | Uncertainty assigned by TRC = 0.2 K |

References

Donnelly, Drewes, et al., 1990
Donnelly, J.R.; Drewes, L.A.; Johnson, R.L.; Munslow, W.D.; Knapp, K.K.; Sovocool, G.W.,
Purity and heat of fusion data for environmental standards as determined by differential scanning calorimetry,
Thermochim. Acta, 1990, 167, 2, 155, https://doi.org/10.1016/0040-6031(90)80476-F
. [all data]