2,4(1H,3H)-Pyrimidinedione, 6-chloro-3-methyl-
- Formula: C5H5ClN2O2
- Molecular weight: 160.558
- IUPAC Standard InChIKey: SGLXGFAZAARYJY-UHFFFAOYSA-N
- CAS Registry Number: 4318-56-3
- Chemical structure:

Phase change data

Data compiled by: William E. Acree, Jr., James S. Chickos
Enthalpy of sublimation
ΔsubH (kcal/mol) | Temperature (K) | Method | Reference |
---|---|---|---|
25. ± 1. | 444. to 493. | HSA | Nowak, Szczepaniak, et al., 1978 |

References

Nowak, Szczepaniak, et al., 1978
Nowak, M.J.; Szczepaniak, K.; Barski, A.; Shugar, D.Z.,
Z. Naturforsch. C, 1978, 33C, 876. [all data]