1-Hexene, 3,5,5-trimethyl-
- Formula: C9H18
- Molecular weight: 126.2392
- IUPAC Standard InChIKey: JTXUVHFRSRTSAT-UHFFFAOYSA-N
- CAS Registry Number: 4316-65-8
- Chemical structure:

Phase change data

Data compiled by: Thermodynamics Research Center, NIST Boulder Laboratories, Chris Muzny director
Quantity | Value | Units | Method | Reference | Comment |
---|---|---|---|---|---|
Tboil | 392.6 | K | N/A | Keulemans, Kwantes, et al., 1948 | Uncertainty assigned by TRC = 5. K |

Kovats' RI, non-polar column, custom temperature program

Column type | Active phase | I | Reference | Comment |
---|---|---|---|---|
Capillary | Petrocol DH-100 | 795. | Haagen-Smit Laboratory, 1997 | He; Column length: 100. m; Column diameter: 0.2 mm; Program: 5C(10min) => 5C/min => 50C(48min) => 1.5C/min => 195C(91min) |

Van Den Dool and Kratz RI, non-polar column, temperature ramp

Column type | Active phase | I | Reference | Comment |
---|---|---|---|---|
Capillary | Petrocol DH | 764. | White, Hackett, et al., 1992 | 100. m/0.25 mm/0.5 μm, He, 1. K/min; Tstart: 30. C; Tend: 220. C |

Normal alkane RI, non-polar column, temperature ramp

Column type | Active phase | I | Reference | Comment |
---|---|---|---|---|
Capillary | Petrocol DH | 768. | Supelco, 2012 | 100. m/0.25 mm/0.50 μm, Helium, 20. C @ 15. min, 15. K/min, 220. C @ 30. min |
Capillary | OV-101 | 763. | Orav, Kailas, et al., 1999 | 50. m/0.20 mm/0.50 μm, Helium, 30. C @ 6. min, 1. K/min; Tend: 100. C |
Capillary | OV-101 | 767. | Orav, Kailas, et al., 1999 | 50. m/0.20 mm/0.50 μm, Helium, 30. C @ 6. min, 1. K/min; Tend: 100. C |

Kovats' RI, non-polar column, isothermal

View large format table.

Column type Active phase Temperature (C) I Reference Comment
CapillaryOV-10140.765.Laub and Purnell, 1988
CapillaryOV-10160.768.Laub and Purnell, 1988
CapillaryOV-10180.770.Laub and Purnell, 1988
CapillaryOV-10130.764.Chien, Furio, et al., 1983
CapillaryOV-10140.765.Chien, Furio, et al., 1983
CapillaryOV-10150.766.Chien, Furio, et al., 1983
CapillaryOV-10160.768.Chien, Furio, et al., 1983
CapillaryOV-10170.769.Chien, Furio, et al., 1983
CapillaryOV-10180.770.Chien, Furio, et al., 1983
CapillaryOV-330.766.5Chien, Furio, et al., 1983, 2
CapillaryOV-340.767.6Chien, Furio, et al., 1983, 2
CapillaryOV-350.768.7Chien, Furio, et al., 1983, 2
CapillaryOV-360.770.0Chien, Furio, et al., 1983, 2
CapillaryOV-370.771.2Chien, Furio, et al., 1983, 2
CapillaryOV-380.772.7Chien, Furio, et al., 1983, 2
CapillaryOV-130.766.Chien, Kopecni, et al., 1981H2
CapillaryOV-140.767.4Chien, Kopecni, et al., 1981H2
CapillaryOV-150.768.8Chien, Kopecni, et al., 1981H2
CapillaryOV-160.767.9Chien, Kopecni, et al., 1981H2
CapillaryOV-170.771.9Chien, Kopecni, et al., 1981H2
CapillaryOV-180.773.8Chien, Kopecni, et al., 1981H2
CapillarySE-3030.765.3Chien, Kopecni, et al., 1981H2
CapillarySE-3040.766.Chien, Kopecni, et al., 1981H2
CapillarySE-3050.767.Chien, Kopecni, et al., 1981H2
CapillarySE-3060.767.9Chien, Kopecni, et al., 1981H2
CapillarySE-3070.768.8Chien, Kopecni, et al., 1981H2
CapillarySE-3080.769.8Chien, Kopecni, et al., 1981H2

References

Keulemans, Kwantes, et al., 1948
Keulemans, A.I.M.; Kwantes, A.; van Bavel, T.,
Recl. Trav. Chim. Pays-Bas, 1948, 67, 298. [all data]
Laub and Purnell, 1988
Laub, R.J.; Purnell, J.H.,
Specific retention volumes, retention indices, and family-plot regressions of aliphatic, alicyclic, and aromatic hydrocarbon solutes with OV-101 poly (dimethylsiloxane) stationary phase,
J. Hi. Res. Chromatogr. Chromatogr. Comm., 1988, 11, 9, 649-660, https://doi.org/10.1002/jhrc.1240110908
. [all data]
Chien, Furio, et al., 1983
Chien, C.-F.; Furio, D.L.; Kopecni, M.M.; Laub, R.J.,
Specific Retention Volumes and Retention Indices of Selected Hydrocarbon Solutes with OV-101 and SP-2100 Polydimethylsiloxane Solvents,
J. Hi. Res. Chromatogr. Chromatogr. Comm., 1983, 6, 10, 577-580, https://doi.org/10.1002/jhrc.1240061013
. [all data]
Chien, Furio, et al., 1983, 2
Chien, C.-F.; Furio, D.L.; Kopecni, M.M.; Laub, R.J.,
Specific retention volumes and retention indices of selected hydrocarbon solutes with OV-3, OV-7, OV-11, OV-17, OV-22, and OV-25 polymethylphenylsiloxane solvents,
J. Hi. Res. Chromatogr., 1983, 6, 12, 669-679, https://doi.org/10.1002/jhrc.1240061207
. [all data]
Chien, Kopecni, et al., 1981
Chien, C.-F.; Kopecni, M.M.; Laub, R.J.,
Specific Retention Volumes and Retention Indices of Selected Hydrocarbon Solutes with OV-1 and SE-30 Polydimethylsiloxane Solvents,
J. Hi. Res. Chromatogr. Chromatogr. Comm., 1981, 4, 10, 539-543, https://doi.org/10.1002/jhrc.1240041017
. [all data]
Haagen-Smit Laboratory, 1997
Haagen-Smit Laboratory,
Procedure for the detailed hydrocarbon analysis of gasolines by single column high efficiency (capillary) column gas chromatography, SOP NO. MLD 118, Revision No. 1.1, California Environmental Protection Agency, Air Resources Board, El Monte, California, 1997, 22. [all data]
White, Hackett, et al., 1992
White, C.M.; Hackett, J.; Anderson, R.R.; Kail, S.; Spock, P.S.,
Linear temperature programmed retention indices of gasoline range hydrocarbons and chlorinated hydrocarbons on cross-linked polydimethylsiloxane,
J. Hi. Res. Chromatogr., 1992, 15, 2, 105-120, https://doi.org/10.1002/jhrc.1240150211
. [all data]
Supelco, 2012
Supelco, CatalogNo. 24160-U,
Petrocol DH Columns. Catalog No. 24160-U, 2012, retrieved from http://www.sigmaaldrich.com/etc/medialib/docs/Supelco/Datasheet/1/w97949.Par.0001.File.tmp/w97949.pdf. [all data]
Orav, Kailas, et al., 1999
Orav, A.; Kailas, T.; Muurisepp, M.; Kann, J.,
Composition of the oil from waste tires. 1. Fraction boiling at yp to 160 0C,
Proc. Estonian Acad. Sci. Chem., 1999, 48, 1, 30-39. [all data]