1-Butylimidazole
- Formula: C7H12N2
- Molecular weight: 124.1836
- IUPAC Standard InChIKey: MCMFEZDRQOJKMN-UHFFFAOYSA-N
- CAS Registry Number: 4316-42-1
- Chemical structure:
View 3d structure (requires JavaScript / HTML 5) - Other names: N-(n-Butyl)imidazole; 1H-Imidazole, 1-butyl-; Imidazole, 1-butyl-; Butylimidazole; N-Butylimidazole; UN 2690

Kovats' RI, non-polar column, isothermal

Column type | Active phase | Temperature (C) | I | Reference | Comment |
---|---|---|---|---|---|
Capillary | OV-101 | 110. | 1164. | Golovnya, Zhuravleva, et al., 1992 | 30. m/0.30 mm/0.20 μm |

Kovats' RI, polar column, isothermal

Column type | Active phase | Temperature (C) | I | Reference | Comment |
---|---|---|---|---|---|
Capillary | PEG-40M/KF | 170. | 1861. | Golovnya, Zhuravleva, et al., 1992 | 30. m/0.3 mm/0.2 μm |

References

Golovnya, Zhuravleva, et al., 1992
Golovnya, R.V.; Zhuravleva, I.L.; Sal'kova, M.A.,
Prediction of Retention Indexes of Alkylimadazoles Under Conditions of Capillary Gas Chromatography,
J. Anal. Chem. USSR (Engl. Transl.), 1992, 7, 932-937. [all data]