(1,1-dimethoxyethyl)benzene
- Formula: C10H14O2
- Molecular weight: 166.2170
- IUPAC Standard InChIKey: XKSUVRWJZCEYQQ-UHFFFAOYSA-N
- CAS Registry Number: 4316-35-2
- Chemical structure:
View 3d structure (requires JavaScript / HTML 5) - Species with the same structure:
- Other names: Benzene, (1,1-dimethoxyethyl)-

Gas phase thermochemistry data

Data compiled by: Hussein Y. Afeefy, Joel F. Liebman, and Stephen E. Stein
Quantity | Value | Units | Method | Reference | Comment |
---|---|---|---|---|---|
ΔfH°gas | -288.5 ± 1.5 | kJ/mol | Ccr | Verevkin, Dogan, et al., 1995 | See Beckhaus, Dogan, et al., 1990 |

Condensed phase thermochemistry data

Data compiled by: Hussein Y. Afeefy, Joel F. Liebman, and Stephen E. Stein
Quantity | Value | Units | Method | Reference | Comment |
---|---|---|---|---|---|
ΔfH°liquid | -343.48 ± 0.72 | kJ/mol | Ccr | Verevkin, Dogan, et al., 1995 | See Beckhaus, Dogan, et al., 1990 |
Quantity | Value | Units | Method | Reference | Comment |
ΔcH°liquid | -5592.42 ± 0.68 | kJ/mol | Ccr | Verevkin, Dogan, et al., 1995 | See Beckhaus, Dogan, et al., 1990; Corresponding ΔfHºliquid = -343.49 kJ/mol (simple calculation by NIST; no Washburn corrections) |

Phase change data

Data compiled as indicated in comments:
AC - William E. Acree, Jr., James S. Chickos
ALS - Hussein Y. Afeefy, Joel F. Liebman, and Stephen E. Stein
DRB - Donald R. Burgess, Jr.
Quantity | Value | Units | Method | Reference | Comment |
---|---|---|---|---|---|
ΔvapH° | 54.0 ± 0.8 | kJ/mol | GS | Verevkin, 2002 | Based on data from 268. to 303. K.; AC |
ΔvapH° | 55.0 ± 1.3 | kJ/mol | V | Verevkin, Dogan, et al., 1995 | See Beckhaus, Dogan, et al., 1990; ALS |
ΔvapH° | 55.0 | kJ/mol | N/A | Verevkin, Dogan, et al., 1995 | DRB |
Enthalpy of vaporization
ΔvapH (kJ/mol) | Temperature (K) | Method | Reference | Comment |
---|---|---|---|---|
55.0 ± 1.3 | 286. | GS | Verevkin, Dogan, et al., 1995 | Based on data from 268. to 303. K.; AC |

References

Verevkin, Dogan, et al., 1995
Verevkin, S.P.; Dogan, B.; Hdrich, J.; Beckhaus, H.-D.; Rchardt, C.,
Geminal substituent effects. VIII. Enthalpies of formation of acetals,
J. Prakt. Chem., 1995, 337, 93-98. [all data]
Beckhaus, Dogan, et al., 1990
Beckhaus, H.D.; Dogan, B.; Verevkin, S.; Hadrich, J.; Ruchardt, C.,
Dependence of anomeric stabilization on structure in acetals,
Angew. Chem. Int. Ed. Engl., 1990, 29, 320-321. [all data]
Verevkin, 2002
Verevkin, Sergey P.,
Improved Benson Increments for the Estimation of Standard Enthalpies of Formation and Enthalpies of Vaporization of Alkyl Ethers, Acetals, Ketals, and Ortho Esters,
J. Chem. Eng. Data, 2002, 47, 5, 1071-1097, https://doi.org/10.1021/je020023o
. [all data]