Methyl trifluoroacetate
- Formula: C3H3F3O2
- Molecular weight: 128.0499
- IUPAC Standard InChIKey: VMVNZNXAVJHNDJ-UHFFFAOYSA-N
- CAS Registry Number: 431-47-0
- Chemical structure:
View 3d structure (requires JavaScript / HTML 5) - Other names: Trifluoroacetic acid methyl ester; Acetic acid, trifluoro-, methyl ester; CF3C(O)OCH3

Gas phase thermochemistry data

Data compiled by: Hussein Y. Afeefy, Joel F. Liebman, and Stephen E. Stein
Quantity | Value | Units | Method | Reference | Comment |
---|---|---|---|---|---|
ΔfH°gas | -992.9 ± 5.4 | kJ/mol | Eqk | Guthrie, 1976 |

Condensed phase thermochemistry data

Data compiled by: Hussein Y. Afeefy, Joel F. Liebman, and Stephen E. Stein
Quantity | Value | Units | Method | Reference | Comment |
---|---|---|---|---|---|
ΔfH°liquid | -1020. ± 5.9 | kJ/mol | Eqk | Guthrie, 1976 |

Phase change data

Data compiled as indicated in comments:
BS - Robert L. Brown and Stephen E. Stein
ALS - Hussein Y. Afeefy, Joel F. Liebman, and Stephen E. Stein
Quantity | Value | Units | Method | Reference | Comment |
---|---|---|---|---|---|
Tboil | 316.5 | K | N/A | Aldrich Chemical Company Inc., 1990 | BS |
Tboil | 316. to 317. | K | N/A | PCR Inc., 1990 | BS |
Quantity | Value | Units | Method | Reference | Comment |
ΔvapH° | 28. ± 3. | kJ/mol | E | Guthrie, 1976 | ALS |

Gas phase ion energetics data

Data evaluated by: Edward P. Hunter and Sharon G. Lias
Quantity | Value | Units | Method | Reference | Comment |
---|---|---|---|---|---|
Proton affinity (review) | 740.5 | kJ/mol | N/A | Hunter and Lias, 1998 | |
Quantity | Value | Units | Method | Reference | Comment |
Gas basicity | 709.6 | kJ/mol | N/A | Hunter and Lias, 1998 |

Kovats' RI, non-polar column, isothermal

Column type | Active phase | Temperature (C) | I | Reference | Comment |
---|---|---|---|---|---|
Capillary | OV-101 | 100. | 400. | Promyshlennikova, Kirichenko, et al., 1992 | |
Capillary | OV-101 | 100. | 400.4 | Promyshlennikova, Kirichenko, et al., 1991 | He; Column length: 50. m; Column diameter: 0.25 mm |

References

Guthrie, 1976
Guthrie, J.P.,
Thermodynamics of ester and orthoester formation from trifluoroacetic acid,
Can. J. Chem., 1976, 54, 202-209. [all data]
Aldrich Chemical Company Inc., 1990
Aldrich Chemical Company Inc.,
Catalog Handbook of Fine Chemicals, Aldrich Chemical Company, Inc., Milwaukee WI, 1990, 1. [all data]
PCR Inc., 1990
PCR Inc.,
Research Chemicals Catalog 1990-1991, PCR Inc., Gainesville, FL, 1990, 1. [all data]
Hunter and Lias, 1998
Hunter, E.P.; Lias, S.G.,
Evaluated Gas Phase Basicities and Proton Affinities of Molecules: An Update,
J. Phys. Chem. Ref. Data, 1998, 27, 3, 413-656, https://doi.org/10.1063/1.556018
. [all data]
Promyshlennikova, Kirichenko, et al., 1992
Promyshlennikova, E.P.; Kirichenko, V.E.; Pashkevich, K.I.; Grigor'eva, D.N.; Golovnya, R.V.,
Influence of the stationary phase nature on the retention of polyfluorinated carboxylic acid esters,
Zh. Anal. Khim., 1992, 47, 1070-1075. [all data]
Promyshlennikova, Kirichenko, et al., 1991
Promyshlennikova, E.P.; Kirichenko, V.E.; Pashkevich, K.I.; Grigor'eva, D.N.; Golovnya, R.V.,
Capillary chromatography of polyfluorinated carboxylic esters,
Izv. Akad. Nauk SSSR Ser. Khim., 1991, 8, 1541-1545. [all data]