propionyl fluoride
- Formula: C3H5FO
- Molecular weight: 76.0696
- IUPAC Standard InChIKey: WMFABESKCHGSRC-UHFFFAOYSA-N
- CAS Registry Number: 430-71-7
- Chemical structure:
View 3d structure (requires JavaScript / HTML 5) - Other names: propanoyl fluoride

Phase change data

Data compiled by: Thermodynamics Research Center, NIST Boulder Laboratories, Chris Muzny director
Quantity | Value | Units | Method | Reference | Comment |
---|---|---|---|---|---|
Tboil | 316.2 | K | N/A | Yamase, 1961 | Uncertainty assigned by TRC = 2. K |

References

Yamase, 1961
Yamase, Y.,
Friedel-Crafts Acylation II. Relative Reactivity for Some Acyl Halides,
Bull. Chem. Soc. Jpn., 1961, 34, 480-84. [all data]